program: Orca
programVersion: 5.0.2
elementType: Cl Cl F O O O N C C C C C C C C C C C C C C C C C C C C C C H H H H H H H H H H H H H H H H H H
charge: 0
multiplicity: 1
keywords: wb97x-d3
keywords: def2-TZVPP
keywords: def2/J RIJCOSX
keywords: DEFGRID2
keywords: scfconv7
keywords: smallprint printgap noloewdin
keywords: NOSOSCF
formula: C22H18Cl2FNO3
InChI: InChI=1/C22H18Cl2FNO3/c1-22(2)15(11-19(23)24)20(22)21(27)29-18(12-26)13-8-9-16(25)17(10-13)28-14-6-4-3-5-7-14/h3-11,15,18,20H,1-2H3
47 atoms
Cl -2.223297 -0.492553 0.175128
Cl -5.099197 -0.278302 0.133456
F  3.211999 -3.176493 -1.248027
O  0.991681 2.263093 0.919516
O  0.687567 2.37214 -1.290799
O  2.231878 -2.818312 1.266223
N  3.590158 3.946098 -0.536026
C  -1.962832 3.81301 -0.349202
C  -2.234682 2.446372 -0.884919
C  -1.183492 2.617146 0.180913
C  -2.944386 4.415986 0.627313
C  -1.300069 4.832059 -1.24237
C  -3.500778 1.739757 -0.591881
C  0.229985 2.403833 -0.183501
C  -3.590341 0.491494 -0.153632
C  2.373975 2.002825 0.720992
C  2.632028 0.630989 0.142761
C  3.029396 3.086627 -0.020307
C  2.299218 -0.465847 0.931063
C  3.16075 0.428232 -1.122642
C  2.500519 -1.752648 0.468504
C  3.367747 -0.859097 -1.59538
C  3.033272 -1.936273 -0.802392
C  1.084675 -3.532927 1.061914
C  0.936551 -4.676118 1.837314
C  0.096065 -3.155589 0.164824
C  -0.210165 -5.440035 1.713181
C  -1.048801 -3.933884 0.053691
C  -1.210183 -5.074535 0.82185
H  -1.831914 2.253657 -1.87666
H  -1.442984 2.3116 1.187855
H  -3.749691 4.927468 0.096534
H  -3.398298 3.670499 1.280787
H  -2.44797 5.153181 1.259584
H  -0.63176 4.386122 -1.974865
H  -2.062504 5.391672 -1.786802
H  -0.723776 5.548141 -0.654178
H  -4.429594 2.265604 -0.781212
H  2.787616 2.03862 1.732335
H  1.882543 -0.335225 1.922885
H  3.413105 1.269916 -1.75267
H  3.780915 -1.027463 -2.580598
H  1.719885 -4.956183 2.529247
H  0.200512 -2.267907 -0.445773
H  -0.32091 -6.330047 2.318621
H  -1.820374 -3.633763 -0.6426
H  -2.10554 -5.673476 0.729084
totalener: -2149.90981652 hartree
nucrepener: 3062.23940545 hartree
electener: -5212.14922197 hartree
oneelecener: -9037.96387184 hartree
twoeener: 3825.81464988 hartree
kineticenergy: 2143.53794857 hartree
xcener: -159.170487953641 hartree
chargesum: -0.0000000
charge: -0.042396 -0.040175 -0.183206 -0.269700 -0.365772 -0.300037 0.006105 0.106181 0.000922 -0.169833 -0.268702 -0.246083 -0.261554 0.391793 0.108507 0.400347 -0.064748 -0.287746 -0.210572 -0.066759 0.121784 -0.164692 0.249174 0.295201 -0.219286 -0.179446 -0.086781 -0.121893 -0.151527 0.108201 0.103597 0.094178 0.088097 0.098215 0.104472 0.086598 0.093169 0.119326 0.124676 0.118992 0.130489 0.129639 0.122477 0.126426 0.124061 0.123821 0.124461
qa: -0.0424 -0.0402 -0.1832 -0.2697 -0.3658 -0.3000 0.0061 0.1062 0.0009 -0.1698 -0.2687 -0.2461 -0.2616 0.3918 0.1085 0.4003 -0.0647 -0.2877 -0.2106 -0.0668 0.1218 -0.1647 0.2492 0.2952 -0.2193 -0.1794 -0.0868 -0.1219 -0.1515 0.1082 0.1036 0.0942 0.0881 0.0982 0.1045 0.0866 0.0932 0.1193 0.1247 0.1190 0.1305 0.1296 0.1225 0.1264 0.1241 0.1238 0.1245
va: 1.3114 1.2661 1.1197 2.1168 2.1345 2.1155 3.1146 3.7463 3.8229 3.8841 3.9094 3.9058 3.9162 4.1545 4.1950 3.9052 3.7247 4.0346 4.0332 3.9018 3.8510 3.9553 4.0527 3.7964 4.0368 3.8746 3.9486 3.9657 3.9907 1.0280 1.0265 1.0020 1.0004 1.0061 1.0191 1.0021 1.0022 1.0178 0.9913 1.0235 1.0207 1.0072 1.0152 1.0223 0.9984 1.0131 1.0006
dispcorr: -0.026950332 hartree
energy: -2149.936766851476
dipole: -2.63205 1.41413 -1.21792 18.43761 -18.30943 0.12819 0.78948 -0.17553 0.61395
magnitude: 1.36992 au
magnitude: 3.48206 debye
