program: Orca
programVersion: 5.0.2
elementType: Cl Cl F O O O N C C C C C C C C C C C C C C C C C C C C C C H H H H H H H H H H H H H H H H H H
charge: 0
multiplicity: 1
keywords: wb97x-d3
keywords: def2-TZVPP
keywords: def2/J RIJCOSX
keywords: DEFGRID2
keywords: scfconv7
keywords: smallprint printgap noloewdin
keywords: NOSOSCF
formula: C22H18Cl2FNO3
InChI: InChI=1/C22H18Cl2FNO3/c1-22(2)15(11-19(23)24)20(22)21(27)29-18(12-26)13-8-9-16(25)17(10-13)28-14-6-4-3-5-7-14/h3-11,15,18,20H,1-2H3
47 atoms
Cl -2.112407 -0.579023 -2.005449
Cl -4.588823 -1.170063 -0.650187
F  4.241998 -3.071688 0.450608
O  0.894659 2.221001 -0.120482
O  1.095229 2.004053 2.096255
O  1.666019 -2.741466 -0.212369
N  2.859546 3.039219 -2.643729
C  -1.958093 3.209955 0.592772
C  -1.938679 1.863909 -0.0647
C  -1.081101 2.113091 1.164843
C  -3.131676 3.617988 1.452161
C  -1.355629 4.374562 -0.156775
C  -3.062823 0.920607 0.014084
C  0.396517 2.108913 1.129167
C  -3.223633 -0.133538 -0.776167
C  2.300102 2.137841 -0.255269
C  2.820702 0.726714 -0.085583
C  2.595195 2.642823 -1.598784
C  1.985935 -0.359655 -0.288767
C  4.145201 0.527187 0.273831
C  2.453907 -1.64842 -0.077022
C  4.6359 -0.758596 0.429097
C  3.78722 -1.834726 0.265924
C  0.409627 -2.718878 0.334868
C  -0.577444 -3.428451 -0.330861
C  0.123374 -2.049031 1.518405
C  -1.862171 -3.460796 0.187499
C  -1.168408 -2.08567 2.020068
C  -2.166662 -2.785035 1.359504
H  -1.388408 1.828336 -0.997177
H  -1.441292 1.689815 2.095391
H  -3.511558 2.807753 2.073685
H  -2.840628 4.4253 2.125366
H  -3.954655 3.981026 0.834252
H  -0.92693 5.10186 0.535026
H  -0.581893 4.08081 -0.861483
H  -2.135057 4.883514 -0.725792
H  -3.827704 1.084454 0.762674
H  2.797372 2.792507 0.469418
H  0.953773 -0.224263 -0.588379
H  4.801993 1.371487 0.440275
H  5.666718 -0.931058 0.707066
H  -0.336569 -3.943495 -1.251275
H  0.891109 -1.500848 2.0491
H  -2.633448 -4.006123 -0.339449
H  -1.389242 -1.563307 2.941732
H  -3.173664 -2.801753 1.752306
totalener: -2149.90842891 hartree
nucrepener: 3168.14776821 hartree
electener: -5318.05619712 hartree
oneelecener: -9249.37037769 hartree
twoeener: 3931.31418057 hartree
kineticenergy: 2143.53073841 hartree
xcener: -159.173356971263 hartree
chargesum: 0.0000000
charge: -0.043673 -0.054023 -0.183081 -0.281270 -0.330272 -0.292088 0.005827 0.075871 0.052234 -0.054910 -0.273782 -0.248622 -0.227282 0.298362 0.085762 0.265003 0.087975 -0.257766 -0.149274 -0.168531 0.160413 -0.143069 0.189909 0.270900 -0.222315 -0.151359 -0.107571 -0.150018 -0.126108 0.095457 0.085485 0.075697 0.097957 0.104518 0.094832 0.097041 0.091592 0.099768 0.131678 0.111730 0.111735 0.126053 0.126011 0.137616 0.128090 0.128280 0.129217
qa: -0.0437 -0.0540 -0.1831 -0.2813 -0.3303 -0.2921 0.0058 0.0759 0.0522 -0.0549 -0.2738 -0.2486 -0.2273 0.2984 0.0858 0.2650 0.0880 -0.2578 -0.1493 -0.1685 0.1604 -0.1431 0.1899 0.2709 -0.2223 -0.1514 -0.1076 -0.1500 -0.1261 0.0955 0.0855 0.0757 0.0980 0.1045 0.0948 0.0970 0.0916 0.0998 0.1317 0.1117 0.1117 0.1261 0.1260 0.1376 0.1281 0.1283 0.1292
va: 1.2846 1.2496 1.1211 2.0806 2.1709 2.1294 3.1167 3.8299 3.7403 3.7994 3.9215 3.9141 3.9422 4.2612 4.2270 3.8440 3.6551 3.9927 3.9544 4.0043 3.7565 3.9153 4.1105 3.7485 3.9990 3.8704 3.8785 3.9272 3.8575 1.0391 1.0285 1.0082 1.0037 1.0003 1.0010 1.0126 1.0034 1.0331 1.0145 1.0257 1.0101 1.0067 1.0133 1.0056 1.0038 1.0006 1.0049
dispcorr: -0.031190635 hartree
energy: -2149.939619545349
dipole: -6.41539 5.34145 -1.07394 23.09921 -22.34930 0.74991 14.34309 -13.21965 1.12345
magnitude: 1.72564 au
magnitude: 4.38623 debye
