program: Orca
programVersion: 5.0.2
elementType: Cl Cl F O O O N C C C C C C C C C C C C C C C C C C C C C C H H H H H H H H H H H H H H H H H H
charge: 0
multiplicity: 1
keywords: wb97x-d3
keywords: def2-TZVPP
keywords: def2/J RIJCOSX
keywords: DEFGRID2
keywords: scfconv7
keywords: smallprint printgap noloewdin
keywords: NOSOSCF
formula: C22H18Cl2FNO3
InChI: InChI=1/C22H18Cl2FNO3/c1-22(2)15(11-19(23)24)20(22)21(27)29-18(12-26)13-8-9-16(25)17(10-13)28-14-6-4-3-5-7-14/h3-11,15,18,20H,1-2H3
47 atoms
Cl -3.777123 4.56156 2.02978
Cl -4.148336 6.410227 -0.152159
F  1.154168 -4.837288 -1.115791
O  0.799964 1.375079 -1.013214
O  -0.327989 1.011345 0.883801
O  1.021825 -3.757136 1.385722
N  4.02833 1.536069 -1.731328
C  -2.78066 1.457167 -1.036855
C  -2.564451 2.657683 -0.163315
C  -1.405143 2.093769 -0.959467
C  -3.504347 1.60315 -2.354149
C  -3.049439 0.133316 -0.362558
C  -3.076127 3.990354 -0.507433
C  -0.296659 1.441638 -0.2361
C  -3.594578 4.862495 0.349028
C  1.91089 0.66831 -0.470408
C  1.745899 -0.820287 -0.644946
C  3.087367 1.167014 -1.185997
C  1.504075 -1.62346 0.461711
C  1.789421 -1.384591 -1.913653
C  1.308755 -2.985507 0.307553
C  1.590875 -2.744581 -2.078963
C  1.347964 -3.530278 -0.970592
C  1.930264 -4.694969 1.798412
C  3.263883 -4.681695 1.416776
C  1.454408 -5.665872 2.669477
C  4.118723 -5.658994 1.908443
C  2.321571 -6.629559 3.154991
C  3.65705 -6.63507 2.776073
H  -2.522362 2.437716 0.897281
H  -1.101278 2.643257 -1.843674
H  -3.266995 0.763463 -3.008902
H  -4.58406 1.608191 -2.197364
H  -3.244595 2.514233 -2.892377
H  -2.668988 -0.692876 -0.966386
H  -2.604604 0.058418 0.62584
H  -4.1259 -0.006476 -0.253142
H  -3.020361 4.308761 -1.541029
H  2.038553 0.907769 0.589936
H  1.447651 -1.197904 1.455345
H  1.985233 -0.768192 -2.781728
H  1.622145 -3.199427 -3.059649
H  3.648927 -3.919546 0.751545
H  0.411606 -5.659756 2.957904
H  5.157874 -5.648014 1.607171
H  1.947128 -7.386391 3.831691
H  4.329669 -7.392958 3.154477
totalener: -2149.91443525 hartree
nucrepener: 2850.99883347 hartree
electener: -5000.91326872 hartree
oneelecener: -8615.05112428 hartree
twoeener: 3614.13785556 hartree
kineticenergy: 2143.52492734 hartree
xcener: -159.165855905459 hartree
chargesum: -0.0000000
charge: -0.037400 -0.043167 -0.182487 -0.258339 -0.379399 -0.295925 0.000811 0.062702 0.045639 -0.089625 -0.245676 -0.246238 -0.205669 0.357791 0.051702 0.317867 -0.031288 -0.261802 -0.090706 -0.130998 0.076595 -0.165430 0.262288 0.272213 -0.142266 -0.209974 -0.139814 -0.091976 -0.142721 0.087372 0.083022 0.094295 0.101034 0.074126 0.089064 0.102811 0.091192 0.097170 0.121693 0.120592 0.126953 0.130564 0.123736 0.123245 0.126529 0.124561 0.125336
qa: -0.0374 -0.0432 -0.1825 -0.2583 -0.3794 -0.2959 0.0008 0.0627 0.0456 -0.0896 -0.2457 -0.2462 -0.2057 0.3578 0.0517 0.3179 -0.0313 -0.2618 -0.0907 -0.1310 0.0766 -0.1654 0.2623 0.2722 -0.1423 -0.2100 -0.1398 -0.0920 -0.1427 0.0874 0.0830 0.0943 0.1010 0.0741 0.0891 0.1028 0.0912 0.0972 0.1217 0.1206 0.1270 0.1306 0.1237 0.1232 0.1265 0.1246 0.1253
va: 1.2899 1.2619 1.1199 2.1361 2.1250 2.1090 3.1172 3.7661 3.8266 3.8642 3.9083 3.9144 3.9236 4.2380 4.2550 3.8294 3.6515 4.0263 3.9594 3.9790 3.8989 3.9406 4.0442 3.7730 3.9084 4.0314 3.9892 3.9528 3.9622 1.0500 1.0348 1.0040 1.0023 1.0099 1.0015 1.0195 1.0024 1.0310 1.0169 1.0298 1.0139 1.0070 1.0120 1.0145 1.0007 0.9986 1.0002
dispcorr: -0.023498800 hartree
energy: -2149.937934054976
dipole: 7.00295 -7.80061 -0.79766 -28.13222 27.32809 -0.80413 -5.88882 5.41961 -0.46921
magnitude: 1.22599 au
magnitude: 3.11622 debye
