program: Orca
programVersion: 5.0.2
elementType: Cl Cl F O O O N C C C C C C C C C C C C C C C C C C C C C C H H H H H H H H H H H H H H H H H H
charge: 0
multiplicity: 1
keywords: wb97x-d3
keywords: def2-TZVPP
keywords: def2/J RIJCOSX
keywords: DEFGRID2
keywords: scfconv7
keywords: smallprint printgap noloewdin
keywords: NOSOSCF
formula: C22H18Cl2FNO3
InChI: InChI=1/C22H18Cl2FNO3/c1-22(2)15(11-19(23)24)20(22)21(27)29-18(12-26)13-8-9-16(25)17(10-13)28-14-6-4-3-5-7-14/h3-11,15,18,20H,1-2H3
47 atoms
Cl -1.952608 4.603232 -0.562686
Cl -4.820474 4.813012 -0.821804
F  4.098699 -3.428806 1.242237
O  0.801576 1.381133 -1.126604
O  0.411131 1.510238 1.071315
O  2.161928 -3.488949 -0.663599
N  3.400316 1.902626 -3.118225
C  -2.379839 0.327889 0.11539
C  -2.483096 1.757858 0.528708
C  -1.422018 1.360276 -0.464347
C  -3.396107 -0.21806 -0.859058
C  -1.899438 -0.690889 1.118326
C  -3.614176 2.6112 0.103505
C  -0.008629 1.426649 -0.048968
C  -3.47866 3.844215 -0.365971
C  2.191916 1.399589 -0.856856
C  2.695549 0.09551 -0.284065
C  2.845416 1.679014 -2.137985
C  2.185266 -1.11331 -0.74026
C  3.677852 0.106125 0.692014
C  2.652229 -2.304306 -0.216039
C  4.169499 -1.083732 1.206671
C  3.652665 -2.276791 0.749972
C  1.325166 -4.198194 0.153803
C  0.695994 -3.647065 1.261676
C  1.099003 -5.521825 -0.199869
C  -0.159581 -4.437842 2.017339
C  0.241459 -6.294821 0.56323
C  -0.392304 -5.75964 1.67679
H  -2.097918 1.980187 1.521163
H  -1.597527 1.613481 -1.503539
H  -2.986405 -1.070164 -1.40277
H  -4.286917 -0.563177 -0.330507
H  -3.711608 0.523297 -1.593492
H  -1.422902 -1.536025 0.617846
H  -1.192874 -0.279448 1.835848
H  -2.749918 -1.082561 1.678968
H  -4.621056 2.223959 0.208266
H  2.440339 2.214831 -0.168089
H  1.417555 -1.148086 -1.503198
H  4.06633 1.045584 1.063109
H  4.940141 -1.088569 1.965331
H  0.858978 -2.615074 1.54472
H  1.599317 -5.935255 -1.065535
H  -0.645895 -4.006343 2.882403
H  0.072006 -7.326954 0.286503
H  -1.058139 -6.368891 2.272396
totalener: -2149.91133590 hartree
nucrepener: 2981.86872942 hartree
electener: -5131.78006532 hartree
oneelecener: -8876.73219059 hartree
twoeener: 3744.95212527 hartree
kineticenergy: 2143.54105262 hartree
xcener: -159.169130658378 hartree
chargesum: 0.0000000
charge: -0.031033 -0.037579 -0.183870 -0.267573 -0.359848 -0.300309 0.003853 0.130610 -0.006306 -0.165463 -0.268874 -0.271428 -0.251587 0.346040 0.093498 0.306070 0.029546 -0.249391 -0.182847 -0.105691 0.114878 -0.158142 0.257133 0.291902 -0.198271 -0.199874 -0.138176 -0.096158 -0.137343 0.109869 0.109681 0.099193 0.094686 0.089767 0.091804 0.102245 0.092788 0.119511 0.124688 0.129722 0.109347 0.128190 0.133914 0.125352 0.125622 0.125443 0.124411
qa: -0.0310 -0.0376 -0.1839 -0.2676 -0.3598 -0.3003 0.0039 0.1306 -0.0063 -0.1655 -0.2689 -0.2714 -0.2516 0.3460 0.0935 0.3061 0.0295 -0.2494 -0.1828 -0.1057 0.1149 -0.1581 0.2571 0.2919 -0.1983 -0.1999 -0.1382 -0.0962 -0.1373 0.1099 0.1097 0.0992 0.0947 0.0898 0.0918 0.1022 0.0928 0.1195 0.1247 0.1297 0.1093 0.1282 0.1339 0.1254 0.1256 0.1254 0.1244
va: 1.3012 1.2683 1.1192 2.1122 2.1413 2.1144 3.1186 3.7247 3.8374 3.8831 3.9118 3.8989 3.9133 4.1826 4.2065 3.8376 3.6642 4.0113 3.9953 3.9856 3.8355 3.9482 4.0536 3.7559 3.8846 4.0272 3.9804 3.9534 3.9601 1.0265 1.0240 1.0066 1.0015 1.0003 0.9982 1.0152 1.0066 1.0169 1.0173 1.0263 1.0110 1.0071 1.0065 1.0140 1.0012 0.9985 1.0001
dispcorr: -0.026549046 hartree
energy: -2149.937884943964
dipole: -5.75719 4.56024 -1.19696 -31.02222 30.30035 -0.72188 9.21392 -8.01310 1.20082
magnitude: 1.84277 au
magnitude: 4.68394 debye
