program: Orca
programVersion: 5.0.2
elementType: Cl Cl F O O O N C C C C C C C C C C C C C C C C C C C C C C H H H H H H H H H H H H H H H H H H
charge: 0
multiplicity: 1
keywords: wb97x-d3
keywords: def2-TZVPP
keywords: def2/J RIJCOSX
keywords: DEFGRID2
keywords: scfconv7
keywords: smallprint printgap noloewdin
keywords: NOSOSCF
formula: C22H18Cl2FNO3
InChI: InChI=1/C22H18Cl2FNO3/c1-22(2)15(11-19(23)24)20(22)21(27)29-18(12-26)13-8-9-16(25)17(10-13)28-14-6-4-3-5-7-14/h3-11,15,18,20H,1-2H3
47 atoms
Cl -2.403088 -0.770272 -1.476703
Cl -4.497632 -1.133993 0.47386
F  3.832538 -3.005736 1.03709
O  1.00097 2.369065 -0.287142
O  1.352547 2.563684 1.910234
O  1.793623 -2.669091 -0.703709
N  2.865325 2.669864 -3.000225
C  -1.84468 3.370347 0.347785
C  -1.80603 1.893813 0.088389
C  -0.88257 2.501519 1.132085
C  -2.9815 3.965546 1.146366
C  -1.357653 4.297143 -0.740874
C  -2.874416 0.9822 0.514679
C  0.587923 2.491085 0.990253
C  -3.200656 -0.154343 -0.09044
C  2.395752 2.183486 -0.476319
C  2.815972 0.785005 -0.099672
C  2.640702 2.453462 -1.89492
C  2.102506 -0.301324 -0.590058
C  3.886278 0.581226 0.756752
C  2.449037 -1.587048 -0.214219
C  4.249167 -0.702953 1.128236
C  3.518452 -1.773123 0.654497
C  0.535627 -2.952865 -0.246968
C  -0.028386 -2.355668 0.871367
C  -0.16893 -3.908811 -0.967405
C  -1.304513 -2.732203 1.267406
C  -1.437862 -4.274783 -0.555435
C  -2.014655 -3.688973 0.56274
H  -1.319741 1.616173 -0.838456
H  -1.163134 2.347281 2.167747
H  -2.69688 4.946154 1.530106
H  -3.863716 4.097448 0.518178
H  -3.271442 3.36011 2.004582
H  -0.921316 5.20149 -0.312719
H  -0.619839 3.843213 -1.397046
H  -2.201685 4.602081 -1.361319
H  -3.456921 1.246199 1.388401
H  2.968615 2.910356 0.109315
H  1.26325 -0.164498 -1.26256
H  4.435084 1.425284 1.153074
H  5.076718 -0.876832 1.802527
H  0.509863 -1.609402 1.440378
H  0.285863 -4.3618 -1.838651
H  -1.743359 -2.264781 2.138974
H  -1.983281 -5.020131 -1.118966
H  -3.009823 -3.970375 0.876146
totalener: -2149.90967075 hartree
nucrepener: 3145.39595365 hartree
electener: -5295.30562440 hartree
oneelecener: -9203.95804309 hartree
twoeener: 3908.65241870 hartree
kineticenergy: 2143.54553998 hartree
xcener: -159.174281390321 hartree
chargesum: -0.0000000
charge: -0.037175 -0.051192 -0.180809 -0.277999 -0.337624 -0.295497 0.006519 0.072083 0.059154 -0.067094 -0.263312 -0.246226 -0.227365 0.319989 0.081541 0.292197 0.012559 -0.264811 -0.150102 -0.090040 0.117855 -0.162927 0.231901 0.279155 -0.145849 -0.213663 -0.147202 -0.072720 -0.169560 0.082252 0.085737 0.096522 0.103127 0.075796 0.092490 0.098248 0.090616 0.096471 0.123628 0.124102 0.111046 0.127695 0.120232 0.124590 0.126391 0.123649 0.125626
qa: -0.0372 -0.0512 -0.1808 -0.2780 -0.3376 -0.2955 0.0065 0.0721 0.0592 -0.0671 -0.2633 -0.2462 -0.2274 0.3200 0.0815 0.2922 0.0126 -0.2648 -0.1501 -0.0900 0.1179 -0.1629 0.2319 0.2792 -0.1458 -0.2137 -0.1472 -0.0727 -0.1696 0.0823 0.0857 0.0965 0.1031 0.0758 0.0925 0.0982 0.0906 0.0965 0.1236 0.1241 0.1110 0.1277 0.1202 0.1246 0.1264 0.1236 0.1256
va: 1.2945 1.2552 1.1244 2.0981 2.1707 2.1206 3.1135 3.7740 3.7688 3.8273 3.9246 3.9174 3.9621 4.2724 4.2543 3.8717 3.6553 4.0106 3.9987 3.9511 3.8140 3.9298 4.0978 3.7530 3.8620 4.0332 3.8781 3.9384 3.9428 1.0426 1.0292 1.0037 1.0006 1.0096 1.0019 1.0121 1.0026 1.0339 1.0172 1.0240 1.0120 1.0070 1.0164 1.0144 1.0046 0.9986 1.0087
dispcorr: -0.030098356 hartree
energy: -2149.939769108095
dipole: -4.77748 3.89615 -0.88133 22.27936 -21.52034 0.75902 6.73621 -5.64602 1.09019
magnitude: 1.59417 au
magnitude: 4.05206 debye
