program: Orca
programVersion: 5.0.2
elementType: Cl Cl F O O O N C C C C C C C C C C C C C C C C C C C C C C H H H H H H H H H H H H H H H H H H
charge: 0
multiplicity: 1
keywords: wb97x-d3
keywords: def2-TZVPP
keywords: def2/J RIJCOSX
keywords: DEFGRID2
keywords: scfconv7
keywords: smallprint printgap noloewdin
keywords: NOSOSCF
formula: C22H18Cl2FNO3
InChI: InChI=1/C22H18Cl2FNO3/c1-22(2)15(11-19(23)24)20(22)21(27)29-18(12-26)13-8-9-16(25)17(10-13)28-14-6-4-3-5-7-14/h3-11,15,18,20H,1-2H3
47 atoms
Cl -3.12081 5.894951 -0.363865
Cl -5.202615 4.830149 -2.051845
F  3.890557 -3.170616 2.343678
O  0.390561 0.646954 -1.145611
O  0.655391 2.351565 0.284143
O  2.942696 -4.059852 -0.06046
N  2.206337 -0.12196 -3.79632
C  -2.332282 1.752751 0.991529
C  -2.277433 2.886785 0.012056
C  -1.541829 1.594343 -0.292333
C  -3.58458 0.914669 1.100378
C  -1.62998 1.932486 2.315676
C  -3.424431 3.259946 -0.826327
C  -0.066285 1.605217 -0.320106
C  -3.850509 4.498171 -1.045267
C  1.803867 0.536083 -1.300504
C  2.382481 -0.47085 -0.338611
C  2.021427 0.162151 -2.69928
C  2.366184 -1.8310 -0.628886
C  2.898185 -0.033329 0.874048
C  2.879158 -2.746623 0.272261
C  3.404369 -0.944337 1.788757
C  3.395092 -2.287979 1.480918
C  2.184936 -4.970453 0.623553
C  1.074832 -4.624482 1.379618
C  2.563202 -6.299641 0.490009
C  0.349868 -5.625484 2.01225
C  1.82586 -7.28528 1.121704
C  0.717291 -6.955144 1.889877
H  -1.63459 3.70665 0.311777
H  -1.994444 0.945912 -1.033835
H  -4.320902 1.411431 1.733778
H  -4.057106 0.714732 0.139536
H  -3.353117 -0.050115 1.553465
H  -2.331054 2.34475 3.042744
H  -1.279091 0.974269 2.702308
H  -0.777957 2.603977 2.259313
H  -3.976211 2.468789 -1.318526
H  2.278858 1.508486 -1.139863
H  1.980161 -2.198806 -1.57209
H  2.906777 1.021596 1.111911
H  3.818829 -0.614838 2.731784
H  0.763038 -3.592413 1.475599
H  3.431103 -6.548616 -0.106087
H  -0.514507 -5.354974 2.604187
H  2.124191 -8.31987 1.016079
H  0.146537 -7.727973 2.386018
totalener: -2149.91454803 hartree
nucrepener: 2843.63653169 hartree
electener: -4993.55107973 hartree
oneelecener: -8600.16021829 hartree
twoeener: 3606.60913857 hartree
kineticenergy: 2143.51952010 hartree
xcener: -159.164932531281 hartree
chargesum: -0.0000000
charge: -0.037736 -0.041207 -0.182637 -0.258164 -0.390106 -0.292947 0.000534 0.068042 0.041109 -0.105283 -0.239097 -0.248509 -0.200484 0.373111 0.048458 0.320727 -0.039012 -0.257373 -0.138755 -0.093925 0.087019 -0.173265 0.258877 0.270550 -0.143727 -0.211925 -0.133205 -0.089370 -0.145662 0.089989 0.083230 0.099909 0.073696 0.094308 0.091340 0.086747 0.102661 0.098470 0.125375 0.125174 0.134154 0.129906 0.119934 0.125080 0.123797 0.125360 0.124829
qa: -0.0377 -0.0412 -0.1826 -0.2582 -0.3901 -0.2929 0.0005 0.0680 0.0411 -0.1053 -0.2391 -0.2485 -0.2005 0.3731 0.0485 0.3207 -0.0390 -0.2574 -0.1388 -0.0939 0.0870 -0.1733 0.2589 0.2705 -0.1437 -0.2119 -0.1332 -0.0894 -0.1457 0.0900 0.0832 0.0999 0.0737 0.0943 0.0913 0.0867 0.1027 0.0985 0.1254 0.1252 0.1342 0.1299 0.1199 0.1251 0.1238 0.1254 0.1248
va: 1.2896 1.2642 1.1196 2.1294 2.1105 2.1113 3.1111 3.7487 3.8303 3.8859 3.9102 3.9129 3.9158 4.2094 4.2533 3.8105 3.7237 4.0197 4.0423 3.9033 3.8967 3.9588 4.0420 3.7801 3.9166 4.0329 3.9850 3.9503 3.9670 1.0471 1.0362 1.0031 1.0104 1.0040 1.0020 1.0022 1.0205 1.0296 1.0193 1.0269 1.0182 1.0072 1.0123 1.0145 1.0010 0.9986 1.0004
dispcorr: -0.023103639 hartree
energy: -2149.937651672036
dipole: 1.24594 -1.99926 -0.75332 -26.68829 26.30583 -0.38246 17.33970 -15.76831 1.57139
magnitude: 1.78410 au
magnitude: 4.53483 debye
