program: Orca
programVersion: 5.0.2
elementType: Cl Cl F O O O N C C C C C C C C C C C C C C C C C C C C C C H H H H H H H H H H H H H H H H H H
charge: 0
multiplicity: 1
keywords: wb97x-d3
keywords: def2-TZVPP
keywords: def2/J RIJCOSX
keywords: DEFGRID2
keywords: scfconv7
keywords: smallprint printgap noloewdin
keywords: NOSOSCF
formula: C22H18Cl2FNO3
InChI: InChI=1/C22H18Cl2FNO3/c1-22(2)15(11-19(23)24)20(22)21(27)29-18(12-26)13-8-9-16(25)17(10-13)28-14-6-4-3-5-7-14/h3-11,15,18,20H,1-2H3
47 atoms
Cl -2.544649 3.744983 1.548897
Cl -4.716605 5.10123 0.214481
F  4.315978 -3.055909 -1.929825
O  0.863591 1.757137 0.07746
O  -0.556409 0.102491 0.576175
O  2.906473 -3.642879 0.242321
N  3.572783 2.978007 1.538767
C  -2.065229 1.185076 -1.960876
C  -2.730364 1.665516 -0.715896
C  -1.243513 1.873605 -0.881203
C  -2.239476 1.98037 -3.232787
C  -1.94501 -0.300683 -2.195358
C  -3.639639 2.832958 -0.715276
C  -0.321263 1.12664 -0.005952
C  -3.633496 3.769988 0.223634
C  1.861186 1.12174 0.868792
C  2.541895 0.0045 0.118624
C  2.809979 2.175983 1.233099
C  2.382626 -1.303693 0.550501
C  3.300545 0.277737 -1.012468
C  2.976068 -2.348414 -0.143629
C  3.905194 -0.756944 -1.704987
C  3.736497 -2.056367 -1.270139
C  1.726107 -4.193656 0.65802
C  0.481688 -3.751262 0.228517
C  1.832509 -5.279528 1.516251
C  -0.657496 -4.405698 0.675091
C  0.685918 -5.926941 1.944555
C  -0.56492 -5.49215 1.53026
H  -2.990355 0.888381 -0.001038
H  -0.917207 2.878359 -1.123369
H  -1.399061 1.810794 -3.906939
H  -3.147377 1.674533 -3.756216
H  -2.305584 3.053445 -3.052465
H  -1.059134 -0.530143 -2.790097
H  -1.889838 -0.871994 -1.272108
H  -2.814606 -0.653377 -2.75218
H  -4.374084 2.920208 -1.507333
H  1.42493 0.732427 1.794139
H  1.781159 -1.516647 1.425248
H  3.435172 1.296536 -1.352196
H  4.506522 -0.563873 -2.582966
H  0.386937 -2.906606 -0.441305
H  2.811856 -5.611668 1.834725
H  -1.626749 -4.056878 0.344303
H  0.773551 -6.774303 2.611526
H  -1.458907 -5.996117 1.870912
totalener: -2149.91226299 hartree
nucrepener: 2955.28050846 hartree
electener: -5105.19277145 hartree
oneelecener: -8823.65422334 hartree
twoeener: 3718.46145189 hartree
kineticenergy: 2143.52843564 hartree
xcener: -159.167796300272 hartree
chargesum: 0.0000000
charge: -0.029393 -0.036616 -0.181718 -0.253541 -0.385979 -0.288479 0.001354 0.121755 -0.024197 -0.159923 -0.271089 -0.254204 -0.241747 0.382855 0.089065 0.317154 -0.009237 -0.256035 -0.139495 -0.162454 0.174923 -0.151697 0.196636 0.276725 -0.171892 -0.223418 -0.111629 -0.083998 -0.148888 0.111506 0.106353 0.096768 0.095098 0.089301 0.093640 0.090931 0.091008 0.119422 0.116584 0.131256 0.126196 0.128348 0.128123 0.126513 0.122384 0.126522 0.125209
qa: -0.0294 -0.0366 -0.1817 -0.2535 -0.3860 -0.2885 0.0014 0.1218 -0.0242 -0.1599 -0.2711 -0.2542 -0.2417 0.3829 0.0891 0.3172 -0.0092 -0.2560 -0.1395 -0.1625 0.1749 -0.1517 0.1966 0.2767 -0.1719 -0.2234 -0.1116 -0.0840 -0.1489 0.1115 0.1064 0.0968 0.0951 0.0893 0.0936 0.0909 0.0910 0.1194 0.1166 0.1313 0.1262 0.1283 0.1281 0.1265 0.1224 0.1265 0.1252
va: 1.3036 1.2697 1.1223 2.1346 2.1138 2.1292 3.1182 3.7142 3.8500 3.8882 3.9159 3.9068 3.9062 4.1589 4.2098 3.8450 3.6610 4.0169 3.9218 3.9877 3.7866 3.9060 4.1124 3.7959 3.9364 4.0350 3.9608 3.9351 3.9741 1.0239 1.0250 1.0062 1.0010 1.0008 1.0006 1.0181 1.0046 1.0162 1.0202 1.0154 1.0141 1.0068 1.0018 1.0144 1.0006 0.9985 1.0006
dispcorr: -0.025347670 hartree
energy: -2149.937610661316
dipole: -3.34690 1.96621 -1.38070 -23.64518 22.97505 -0.67014 -14.16787 13.07872 -1.08915
magnitude: 1.88193 au
magnitude: 4.78348 debye
