program: Orca
programVersion: 5.0.2
elementType: Cl Cl F O O O N C C C C C C C C C C C C C C C C C C C C C C H H H H H H H H H H H H H H H H H H
charge: 0
multiplicity: 1
keywords: wb97x-d3
keywords: def2-TZVPP
keywords: def2/J RIJCOSX
keywords: DEFGRID2
keywords: scfconv7
keywords: smallprint printgap noloewdin
keywords: NOSOSCF
formula: C22H18Cl2FNO3
InChI: InChI=1/C22H18Cl2FNO3/c1-22(2)15(11-19(23)24)20(22)21(27)29-18(12-26)13-8-9-16(25)17(10-13)28-14-6-4-3-5-7-14/h3-11,15,18,20H,1-2H3
47 atoms
Cl -2.794579 5.307371 -1.97531
Cl -5.430167 4.157832 -1.747517
F  5.080403 -1.923677 2.281268
O  0.16426 0.198776 -0.969136
O  0.902372 2.275101 -0.576017
O  2.950301 -3.400427 1.806886
N  0.943716 -2.015509 -3.303242
C  -1.564921 2.444555 1.340605
C  -1.93573 3.026816 0.011796
C  -1.312555 1.640085 0.081806
C  -2.642648 1.908978 2.254365
C  -0.426494 3.085621 2.096539
C  -3.325442 3.159485 -0.440015
C  0.032481 1.45143 -0.496836
C  -3.779158 4.086591 -1.275197
C  1.41996 -0.134998 -1.551628
C  2.410086 -0.60425 -0.51635
C  1.135659 -1.188004 -2.530329
C  2.184112 -1.805172 0.150964
C  3.522642 0.162005 -0.217243
C  3.084327 -2.256352 1.100435
C  4.42951 -0.282001 0.736664
C  4.209672 -1.478957 1.377538
C  2.064858 -4.349278 1.358581
C  0.945196 -4.624309 2.124799
C  2.31023 -5.036162 0.178585
C  0.060077 -5.606561 1.703196
C  1.414356 -6.007959 -0.236422
C  0.28844 -6.295994 0.522565
H  -1.257622 3.792738 -0.346646
H  -1.983726 0.803226 -0.072584
H  -2.20612 1.236465 2.993815
H  -3.128184 2.724773 2.792221
H  -3.416106 1.348444 1.730312
H  0.324349 3.525485 1.446203
H  -0.819314 3.876692 2.73743
H  0.070849 2.356562 2.7385
H  -4.05278 2.443381 -0.078748
H  1.831756 0.723085 -2.091448
H  1.309139 -2.399306 -0.083782
H  3.687964 1.106157 -0.717867
H  5.309513 0.297671 0.980207
H  0.775859 -4.078185 3.043448
H  3.190419 -4.811168 -0.410103
H  -0.814094 -5.827964 2.300851
H  1.59908 -6.54264 -1.158299
H  -0.406898 -7.056367 0.194112
totalener: -2149.91445423 hartree
nucrepener: 2877.16531652 hartree
electener: -5027.07977076 hartree
oneelecener: -8667.61493886 hartree
twoeener: 3640.53516810 hartree
kineticenergy: 2143.52662447 hartree
xcener: -159.167175959472 hartree
chargesum: -0.0000000
charge: -0.038131 -0.043107 -0.183806 -0.265536 -0.383005 -0.285693 -0.002748 0.072786 0.028873 -0.092590 -0.254518 -0.246164 -0.195899 0.363917 0.051420 0.332204 -0.034344 -0.265058 -0.154780 -0.113308 0.156926 -0.146080 0.194508 0.203982 -0.170011 -0.146047 -0.115127 -0.112442 -0.119795 0.087756 0.083991 0.094145 0.101809 0.075742 0.103278 0.090084 0.087887 0.096911 0.120554 0.129372 0.118730 0.126026 0.126147 0.134604 0.127458 0.130438 0.128643
qa: -0.0381 -0.0431 -0.1838 -0.2655 -0.3830 -0.2857 -0.0027 0.0728 0.0289 -0.0926 -0.2545 -0.2462 -0.1959 0.3639 0.0514 0.3322 -0.0343 -0.2651 -0.1548 -0.1133 0.1569 -0.1461 0.1945 0.2040 -0.1700 -0.1460 -0.1151 -0.1124 -0.1198 0.0878 0.0840 0.0941 0.1018 0.0757 0.1033 0.0901 0.0879 0.0969 0.1206 0.1294 0.1187 0.1260 0.1261 0.1346 0.1275 0.1304 0.1286
va: 1.2895 1.2621 1.1184 2.1355 2.1205 2.1181 3.1165 3.7547 3.8438 3.8626 3.9129 3.9130 3.9234 4.2258 4.2594 3.8308 3.7402 4.0253 3.9376 3.9329 3.7824 3.9260 4.0845 3.8371 4.0204 3.9848 3.9413 3.9550 3.9458 1.0495 1.0345 1.0044 1.0015 1.0096 1.0214 1.0008 1.0024 1.0323 1.0199 1.0200 1.0176 1.0073 1.0106 1.0024 0.9994 0.9997 0.9996
dispcorr: -0.023375218 hartree
energy: -2149.937829450082
dipole: 4.66460 -5.07784 -0.41324 -17.78726 17.80869 0.02143 18.52862 -17.34304 1.18558
magnitude: 1.25572 au
magnitude: 3.19179 debye
