program: Orca
programVersion: 5.0.2
elementType: Cl Cl F O O O N C C C C C C C C C C C C C C C C C C C C C C H H H H H H H H H H H H H H H H H H
charge: 0
multiplicity: 1
keywords: wb97x-d3
keywords: def2-TZVPP
keywords: def2/J RIJCOSX
keywords: DEFGRID2
keywords: scfconv7
keywords: smallprint printgap noloewdin
keywords: NOSOSCF
formula: C22H18Cl2FNO3
InChI: InChI=1/C22H18Cl2FNO3/c1-22(2)15(11-19(23)24)20(22)21(27)29-18(12-26)13-8-9-16(25)17(10-13)28-14-6-4-3-5-7-14/h3-11,15,18,20H,1-2H3
47 atoms
Cl -2.375006 -0.762693 -1.506128
Cl -4.484009 -1.13838 0.426485
F  3.82263 -2.991614 1.07503
O  1.002683 2.370738 -0.307331
O  1.365737 2.581171 1.886862
O  1.803161 -2.676005 -0.688962
N  2.83512 2.622586 -3.042665
C  -1.83951 3.37091 0.340311
C  -1.79548 1.895662 0.074208
C  -0.873527 2.502055 1.119615
C  -2.977401 3.958095 1.143078
C  -1.354918 4.305865 -0.74256
C  -2.861573 0.977794 0.492711
C  0.596749 2.498419 0.97135
C  -3.182181 -0.155808 -0.121034
C  2.3959 2.179893 -0.505173
C  2.815449 0.786029 -0.111497
C  2.626505 2.429467 -1.929854
C  2.105484 -0.305845 -0.595002
C  3.878732 0.592284 0.75548
C  2.449522 -1.587265 -0.202929
C  4.238429 -0.687603 1.144519
C  3.511716 -1.763077 0.676886
C  0.539505 -2.960371 -0.249817
C  -0.041293 -2.362096 0.859327
C  -0.152323 -3.919892 -0.977378
C  -1.321299 -2.741902 1.238851
C  -1.425581 -4.2891 -0.581885
C  -2.019084 -3.702719 0.526925
H  -1.307666 1.624303 -0.853617
H  -1.150159 2.343767 2.15575
H  -2.691632 4.932149 1.542218
H  -3.856512 4.101625 0.513211
H  -3.272848 3.340981 1.990978
H  -2.201253 4.622043 -1.354055
H  -0.910307 5.203311 -0.308725
H  -0.624503 3.854459 -1.40851
H  -3.449114 1.234628 1.365176
H  2.975007 2.914644 0.064119
H  1.271841 -0.175998 -1.275569
H  4.424207 1.440878 1.146454
H  5.060441 -0.853876 1.827179
H  0.486851 -1.61242 1.433517
H  0.315257 -4.373762 -1.841234
H  -1.773573 -2.274181 2.103283
H  -1.960293 -5.037545 -1.151467
H  -3.017398 -3.986919 0.827865
totalener: -2149.90957301 hartree
nucrepener: 3146.56244546 hartree
electener: -5296.47201848 hartree
oneelecener: -9206.30070861 hartree
twoeener: 3909.82869014 hartree
kineticenergy: 2143.54864113 hartree
xcener: -159.174903269191 hartree
chargesum: 0.0000000
charge: -0.037355 -0.051065 -0.180781 -0.277370 -0.337482 -0.295252 0.006293 0.071440 0.057792 -0.064444 -0.264132 -0.245861 -0.227136 0.319274 0.081975 0.293232 0.010783 -0.265164 -0.149172 -0.088624 0.116960 -0.162497 0.230851 0.277882 -0.145663 -0.213864 -0.148085 -0.072768 -0.167434 0.082125 0.085800 0.097039 0.102822 0.075718 0.090320 0.092859 0.098093 0.096455 0.123368 0.123824 0.111088 0.127690 0.120025 0.124608 0.126783 0.123733 0.125321
qa: -0.0374 -0.0511 -0.1808 -0.2774 -0.3375 -0.2953 0.0063 0.0714 0.0578 -0.0644 -0.2641 -0.2459 -0.2271 0.3193 0.0820 0.2932 0.0108 -0.2652 -0.1492 -0.0886 0.1170 -0.1625 0.2309 0.2779 -0.1457 -0.2139 -0.1481 -0.0728 -0.1674 0.0821 0.0858 0.0970 0.1028 0.0757 0.0903 0.0929 0.0981 0.0965 0.1234 0.1238 0.1111 0.1277 0.1200 0.1246 0.1268 0.1237 0.1253
va: 1.2943 1.2555 1.1243 2.0984 2.1713 2.1202 3.1130 3.7755 3.7682 3.8258 3.9251 3.9167 3.9618 4.2726 4.2548 3.8726 3.6548 4.0110 3.9999 3.9494 3.8153 3.9301 4.0981 3.7548 3.8627 4.0334 3.8768 3.9401 3.9434 1.0433 1.0290 1.0035 1.0007 1.0097 1.0027 1.0017 1.0122 1.0341 1.0168 1.0243 1.0123 1.0071 1.0164 1.0144 1.0045 0.9985 1.0088
dispcorr: -0.030130868 hartree
energy: -2149.939703878813
dipole: -4.84802 3.97546 -0.87256 22.25655 -21.48451 0.77204 6.78998 -5.69644 1.09354
magnitude: 1.59788 au
magnitude: 4.06150 debye
