program: Orca
programVersion: 5.0.2
elementType: Cl Cl F O O O N C C C C C C C C C C C C C C C C C C C C C C H H H H H H H H H H H H H H H H H H
charge: 0
multiplicity: 1
keywords: wb97x-d3
keywords: def2-TZVPP
keywords: def2/J RIJCOSX
keywords: DEFGRID2
keywords: scfconv7
keywords: smallprint printgap noloewdin
keywords: NOSOSCF
formula: C22H18Cl2FNO3
InChI: InChI=1/C22H18Cl2FNO3/c1-22(2)15(11-19(23)24)20(22)21(27)29-18(12-26)13-8-9-16(25)17(10-13)28-14-6-4-3-5-7-14/h3-11,15,18,20H,1-2H3
47 atoms
Cl -1.904355 4.71372 -1.753157
Cl -4.71536 5.220107 -1.336284
F  3.072614 -2.637449 3.011865
O  0.488778 0.894322 -1.450645
O  0.74232 2.241399 0.316208
O  0.815184 -3.121556 1.576759
N  2.478609 -0.605587 -3.63006
C  -2.247873 1.114294 0.659696
C  -2.181088 2.598633 0.488003
C  -1.454416 1.72069 -0.489267
C  -3.511818 0.390484 0.260985
C  -1.536812 0.484878 1.832397
C  -3.359764 3.381775 0.05744
C  0.0206 1.689665 -0.465559
C  -3.328784 4.313528 -0.885593
C  1.875395 0.606279 -1.395072
C  2.217048 -0.274342 -0.215598
C  2.192618 -0.070089 -2.65523
C  1.392091 -1.345415 0.103151
C  3.332883 -0.009554 0.560652
C  1.6686 -2.133077 1.204957
C  3.635721 -0.811768 1.650146
C  2.802191 -1.865045 1.964119
C  1.034848 -4.397417 1.134813
C  0.149399 -5.360407 1.602346
C  2.053622 -4.741708 0.258672
C  0.289699 -6.673567 1.189886
C  2.180466 -6.06506 -0.143526
C  1.305171 -7.035231 0.314557
H  -1.531256 3.115097 1.190613
H  -1.894427 1.584628 -1.470962
H  -4.009447 0.854108 -0.591253
H  -3.291941 -0.643586 -0.00741
H  -4.221335 0.370869 1.09052
H  -0.635442 1.021242 2.122701
H  -2.200793 0.467679 2.698779
H  -1.256881 -0.547747 1.613909
H  -4.303667 3.213438 0.562613
H  2.465436 1.52814 -1.346784
H  0.512592 -1.571221 -0.487912
H  3.967383 0.836543 0.331229
H  4.501884 -0.612586 2.266465
H  -0.639341 -5.073407 2.285219
H  2.74409 -4.000083 -0.120922
H  -0.40232 -7.420375 1.556379
H  2.975764 -6.330719 -0.827234
H  1.41113 -8.062484 -0.006302
totalener: -2149.91024915 hartree
nucrepener: 2955.02022914 hartree
electener: -5104.93047829 hartree
oneelecener: -8823.18258509 hartree
twoeener: 3718.25210680 hartree
kineticenergy: 2143.54169788 hartree
xcener: -159.168494699843 hartree
chargesum: -0.0000000
charge: -0.030543 -0.038985 -0.182519 -0.264064 -0.346214 -0.306725 0.002532 0.116792 0.002024 -0.163291 -0.269118 -0.255199 -0.256585 0.331320 0.093092 0.317748 0.038950 -0.256417 -0.203817 -0.091655 0.114900 -0.164628 0.246053 0.286484 -0.220420 -0.151533 -0.089443 -0.139168 -0.145992 0.108592 0.109557 0.089329 0.097669 0.094886 0.101531 0.096506 0.085837 0.119899 0.124765 0.137024 0.110516 0.128713 0.121383 0.123015 0.124102 0.127651 0.125443
qa: -0.0305 -0.0390 -0.1825 -0.2641 -0.3462 -0.3067 0.0025 0.1168 0.0020 -0.1633 -0.2691 -0.2552 -0.2566 0.3313 0.0931 0.3177 0.0389 -0.2564 -0.2038 -0.0917 0.1149 -0.1646 0.2461 0.2865 -0.2204 -0.1515 -0.0894 -0.1392 -0.1460 0.1086 0.1096 0.0893 0.0977 0.0949 0.1015 0.0965 0.0858 0.1199 0.1248 0.1370 0.1105 0.1287 0.1214 0.1230 0.1241 0.1277 0.1254
va: 1.3004 1.2669 1.1226 2.1148 2.1569 2.0717 3.1176 3.7413 3.8299 3.8557 3.9079 3.8933 3.9175 4.2341 4.2072 3.8251 3.6285 4.0190 3.9829 3.9738 3.7654 3.9380 4.0962 3.7702 4.0361 3.9159 3.9513 3.9903 3.9653 1.0262 1.0232 1.0004 1.0070 1.0016 1.0146 1.0050 1.0077 1.0167 1.0158 1.0220 1.0107 1.0070 1.0152 1.0159 0.9990 1.0003 1.0003
dispcorr: -0.026181110 hartree
energy: -2149.936430260806
dipole: 1.00886 -1.53203 -0.52317 -30.18298 30.03463 -0.14835 11.55153 -10.49663 1.05490
magnitude: 1.18681 au
magnitude: 3.01664 debye
