program: Orca
programVersion: 5.0.2
elementType: Cl Cl F O O O N C C C C C C C C C C C C C C C C C C C C C C H H H H H H H H H H H H H H H H H H
charge: 0
multiplicity: 1
keywords: wb97x-d3
keywords: def2-TZVPP
keywords: def2/J RIJCOSX
keywords: DEFGRID2
keywords: scfconv7
keywords: smallprint printgap noloewdin
keywords: NOSOSCF
formula: C22H18Cl2FNO3
InChI: InChI=1/C22H18Cl2FNO3/c1-22(2)15(11-19(23)24)20(22)21(27)29-18(12-26)13-8-9-16(25)17(10-13)28-14-6-4-3-5-7-14/h3-11,15,18,20H,1-2H3
47 atoms
Cl -5.097019 2.251047 0.936923
Cl -5.363898 4.446304 -0.914757
F  4.494409 -3.272721 -1.557247
O  1.241773 1.815293 -0.211002
O  -0.162317 0.570271 1.011214
O  2.96878 -3.472145 0.6140
N  4.019331 3.394699 0.66847
C  -1.871601 0.683317 -1.610667
C  -2.424689 1.643156 -0.599058
C  -0.952299 1.693379 -0.948163
C  -2.148522 0.902506 -3.079091
C  -1.812811 -0.777835 -1.236499
C  -3.284577 2.770811 -0.983118
C  0.038915 1.282787 0.065748
C  -4.425771 3.104338 -0.393296
C  2.33059 1.403557 0.613675
C  2.964701 0.154724 0.057144
C  3.267555 2.527474 0.635174
C  2.663772 -1.074403 0.629434
C  3.790729 0.221156 -1.057024
C  3.177918 -2.243611 0.086542
C  4.31608 -0.938792 -1.5976
C  3.999974 -2.156348 -1.03142
C  1.736826 -3.81098 1.1044
C  1.712836 -4.635257 2.219305
C  0.554779 -3.404948 0.499897
C  0.495168 -5.056474 2.72984
C  -0.655729 -3.824621 1.029331
C  -0.693873 -4.649193 2.14337
H  -2.640249 1.202795 0.367924
H  -0.627314 2.506867 -1.58704
H  -1.415265 0.369266 -3.685372
H  -3.137253 0.523057 -3.340909
H  -2.109447 1.95056 -3.372784
H  -0.997638 -1.278112 -1.763706
H  -1.677877 -0.940056 -0.170095
H  -2.743118 -1.264101 -1.534463
H  -2.97447 3.392585 -1.813735
H  1.990993 1.229869 1.638958
H  2.016399 -1.12677 1.495704
H  4.039682 1.175356 -1.502735
H  4.965767 -0.907284 -2.461467
H  2.644033 -4.945471 2.674256
H  0.570228 -2.770075 -0.376263
H  0.478915 -5.701825 3.597973
H  -1.576311 -3.505283 0.558834
H  -1.642247 -4.973172 2.549411
totalener: -2149.91364299 hartree
nucrepener: 2938.42432482 hartree
electener: -5088.33796781 hartree
oneelecener: -8789.61534561 hartree
twoeener: 3701.27737780 hartree
kineticenergy: 2143.53684186 hartree
xcener: -159.169993375434 hartree
chargesum: -0.0000000
charge: -0.038067 -0.041214 -0.181330 -0.255592 -0.381868 -0.288743 0.000050 0.091453 0.045317 -0.105550 -0.238966 -0.291741 -0.204636 0.365511 0.049304 0.310831 -0.016820 -0.258287 -0.138625 -0.151761 0.161127 -0.153868 0.199254 0.241130 -0.209516 -0.149382 -0.088730 -0.107110 -0.148839 0.091385 0.082801 0.095180 0.100647 0.074575 0.092150 0.099749 0.099382 0.098677 0.123456 0.139562 0.124420 0.128880 0.128015 0.126929 0.127171 0.127736 0.125956
qa: -0.0381 -0.0412 -0.1813 -0.2556 -0.3819 -0.2887 0.0001 0.0915 0.0453 -0.1056 -0.2390 -0.2917 -0.2046 0.3655 0.0493 0.3108 -0.0168 -0.2583 -0.1386 -0.1518 0.1611 -0.1539 0.1993 0.2411 -0.2095 -0.1494 -0.0887 -0.1071 -0.1488 0.0914 0.0828 0.0952 0.1006 0.0746 0.0921 0.0997 0.0994 0.0987 0.1235 0.1396 0.1244 0.1289 0.1280 0.1269 0.1272 0.1277 0.1260
va: 1.2894 1.2641 1.1225 2.1326 2.1152 2.1265 3.1145 3.7337 3.8256 3.9009 3.9080 3.9202 3.9146 4.2208 4.2518 3.8317 3.7160 4.0215 3.8953 3.9933 3.7915 3.9168 4.1070 3.8526 4.0327 3.9395 3.9416 3.9501 3.9971 1.0462 1.0364 1.0043 1.0031 1.0103 0.9962 1.0138 1.0037 1.0291 1.0199 1.0170 1.0149 1.0071 1.0130 0.9978 0.9982 0.9989 1.0011
dispcorr: -0.025451609 hartree
energy: -2149.939094600128
dipole: 5.90687 -6.76938 -0.86252 -19.95754 19.10909 -0.84845 -6.31028 5.54990 -0.76038
magnitude: 1.42898 au
magnitude: 3.63217 debye
