program: Orca
programVersion: 5.0.2
elementType: Cl Cl F O O O N C C C C C C C C C C C C C C C C C C C C C C H H H H H H H H H H H H H H H H H H
charge: 0
multiplicity: 1
keywords: wb97x-d3
keywords: def2-TZVPP
keywords: def2/J RIJCOSX
keywords: DEFGRID2
keywords: scfconv7
keywords: smallprint printgap noloewdin
keywords: NOSOSCF
formula: C22H18Cl2FNO3
InChI: InChI=1/C22H18Cl2FNO3/c1-22(2)15(11-19(23)24)20(22)21(27)29-18(12-26)13-8-9-16(25)17(10-13)28-14-6-4-3-5-7-14/h3-11,15,18,20H,1-2H3
47 atoms
Cl -3.778306 4.640314 0.802744
Cl -4.875006 4.848318 -1.856338
F  4.087726 -3.99316 0.142427
O  1.115065 1.334512 -0.935113
O  0.172589 1.561871 1.08623
O  2.582974 -2.853637 2.117104
N  3.920015 2.815162 -1.887863
C  -2.359788 0.503306 -0.407257
C  -2.44713 1.992129 -0.263979
C  -1.199167 1.368197 -0.863619
C  -3.12833 -0.196286 -1.503669
C  -2.258818 -0.323552 0.852568
C  -3.301547 2.819796 -1.123843
C  0.062923 1.439434 -0.103745
C  -3.899923 3.948809 -0.763768
C  2.417616 1.330217 -0.352173
C  2.927323 -0.084217 -0.227482
C  3.253811 2.16068 -1.219603
C  2.543057 -0.829431 0.884092
C  3.699078 -0.676534 -1.216414
C  2.927851 -2.151369 1.008848
C  4.09731 -1.999605 -1.095341
C  3.712907 -2.723805 0.012211
C  1.743767 -3.926875 1.989519
C  1.72847 -4.822898 3.049404
C  0.91819 -4.119342 0.891058
C  0.884996 -5.919217 3.003089
C  0.083512 -5.227773 0.857504
C  0.06181 -6.132388 1.905816
H  -2.315796 2.355187 0.748799
H  -1.079963 1.453089 -1.937632
H  -3.125756 0.345658 -2.44857
H  -2.696021 -1.178995 -1.696309
H  -4.168048 -0.342831 -1.207222
H  -1.794534 0.208979 1.677985
H  -3.259293 -0.620477 1.170535
H  -1.686297 -1.23616 0.675724
H  -3.458018 2.501955 -2.146949
H  2.391136 1.803435 0.633809
H  1.938803 -0.388615 1.667167
H  4.010401 -0.111943 -2.085611
H  4.710707 -2.467049 -1.853614
H  2.378631 -4.656485 3.897994
H  0.913732 -3.42001 0.064941
H  0.878331 -6.617077 3.829792
H  -0.555068 -5.379806 -0.002647
H  -0.589794 -6.994519 1.870207
totalener: -2149.91440675 hartree
nucrepener: 2894.35669698 hartree
electener: -5044.27110374 hartree
oneelecener: -8701.53858302 hartree
twoeener: 3657.26747929 hartree
kineticenergy: 2143.52448459 hartree
xcener: -159.166764218198 hartree
chargesum: 0.0000000
charge: -0.036587 -0.042816 -0.182537 -0.255635 -0.385728 -0.296406 -0.001466 0.069075 0.037779 -0.089280 -0.252316 -0.243216 -0.201958 0.367602 0.051955 0.306136 -0.041955 -0.248812 -0.132503 -0.128682 0.093223 -0.153044 0.252264 0.281270 -0.207192 -0.158244 -0.091641 -0.134869 -0.143092 0.089356 0.082601 0.075862 0.093279 0.101901 0.103394 0.091068 0.082875 0.096228 0.130727 0.142872 0.128974 0.131259 0.124720 0.118226 0.125284 0.124607 0.125442
qa: -0.0366 -0.0428 -0.1825 -0.2556 -0.3857 -0.2964 -0.0015 0.0691 0.0378 -0.0893 -0.2523 -0.2432 -0.2020 0.3676 0.0520 0.3061 -0.0420 -0.2488 -0.1325 -0.1287 0.0932 -0.1530 0.2523 0.2813 -0.2072 -0.1582 -0.0916 -0.1349 -0.1431 0.0894 0.0826 0.0759 0.0933 0.1019 0.1034 0.0911 0.0829 0.0962 0.1307 0.1429 0.1290 0.1313 0.1247 0.1182 0.1253 0.1246 0.1254
va: 1.2912 1.2622 1.1197 2.1227 2.1152 2.1111 3.1120 3.7540 3.8340 3.8597 3.9117 3.9181 3.9230 4.2179 4.2595 3.8210 3.7833 4.0153 3.9487 3.9776 3.8754 3.9490 4.0454 3.7654 4.0312 3.9072 3.9519 3.9860 3.9674 1.0487 1.0350 1.0102 1.0040 1.0018 1.0194 1.0029 1.0026 1.0326 1.0215 1.0252 1.0179 1.0069 1.0142 1.0133 0.9987 1.0007 1.0002
dispcorr: -0.023868733 hartree
energy: -2149.938275484743
dipole: -0.05401 -0.85070 -0.90471 -32.00860 30.43897 -1.56963 2.70142 -2.87061 -0.16919
magnitude: 1.81958 au
magnitude: 4.62500 debye
