program: Orca
programVersion: 5.0.2
elementType: Cl Cl F O O O N C C C C C C C C C C C C C C C C C C C C C C H H H H H H H H H H H H H H H H H H
charge: 0
multiplicity: 1
keywords: wb97x-d3
keywords: def2-TZVPP
keywords: def2/J RIJCOSX
keywords: DEFGRID2
keywords: scfconv7
keywords: smallprint printgap noloewdin
keywords: NOSOSCF
formula: C22H18Cl2FNO3
InChI: InChI=1/C22H18Cl2FNO3/c1-22(2)15(11-19(23)24)20(22)21(27)29-18(12-26)13-8-9-16(25)17(10-13)28-14-6-4-3-5-7-14/h3-11,15,18,20H,1-2H3
47 atoms
Cl -4.886003 1.998869 1.437021
Cl -5.455017 4.291042 -0.216899
F  4.24907 -3.491406 -1.508928
O  1.302409 1.845652 -0.222724
O  -0.041867 0.55008 1.012058
O  2.892061 -3.477439 0.815495
N  4.218961 3.283983 0.38993
C  -1.825832 0.824599 -1.575764
C  -2.38831 1.61841 -0.432595
C  -0.937141 1.797243 -0.823221
C  -2.16988 1.205814 -2.995757
C  -1.666376 -0.664604 -1.388864
C  -3.329636 2.727459 -0.636108
C  0.110249 1.315039 0.0993
C  -4.408277 2.965571 0.100489
C  2.424198 1.39162 0.531172
C  2.950177 0.086493 -0.010423
C  3.420571 2.460377 0.442171
C  2.671472 -1.092393 0.665003
C  3.668912 0.048984 -1.200204
C  3.107081 -2.309255 0.162125
C  4.11405 -1.159566 -1.704964
C  3.826469 -2.327728 -1.025124
C  1.609007 -3.872662 1.077474
C  0.521818 -3.472222 0.312665
C  1.437929 -4.740902 2.146673
C  -0.741714 -3.948481 0.631098
C  0.170865 -5.211965 2.44725
C  -0.926339 -4.816701 1.695051
H  -2.533255 1.049748 0.478758
H  -0.675462 2.697342 -1.368446
H  -1.434181 0.792179 -3.686679
H  -3.147551 0.807851 -3.271623
H  -2.193821 2.282596 -3.157798
H  -0.847009 -1.044207 -2.002981
H  -1.475942 -0.948238 -0.356242
H  -2.579019 -1.169385 -1.709999
H  -3.140352 3.41841 -1.448068
H  2.154799 1.27525 1.585411
H  2.102337 -1.075999 1.585927
H  3.900364 0.96305 -1.731833
H  4.682367 -1.204532 -2.624043
H  0.646966 -2.79901 -0.525109
H  2.296811 -5.043817 2.730776
H  -1.58773 -3.636237 0.032819
H  0.041657 -5.889133 3.281045
H  -1.914908 -5.182451 1.93621
totalener: -2149.91356882 hartree
nucrepener: 2946.48193399 hartree
electener: -5096.39550281 hartree
oneelecener: -8805.75757929 hartree
twoeener: 3709.36207647 hartree
kineticenergy: 2143.53013762 hartree
xcener: -159.168156324782 hartree
chargesum: -0.0000000
charge: -0.037457 -0.042355 -0.180484 -0.253506 -0.379110 -0.294160 0.000815 0.084842 0.044857 -0.094951 -0.244993 -0.281720 -0.208384 0.361249 0.053486 0.312668 -0.031272 -0.259610 -0.102998 -0.134184 0.121768 -0.167533 0.222955 0.236366 -0.126164 -0.203835 -0.126690 -0.090915 -0.148937 0.089270 0.083957 0.094707 0.101682 0.075218 0.093235 0.095907 0.097985 0.097893 0.123418 0.134951 0.126061 0.129323 0.118810 0.127107 0.129198 0.126105 0.125422
qa: -0.0375 -0.0424 -0.1805 -0.2535 -0.3791 -0.2942 0.0008 0.0848 0.0449 -0.0950 -0.2450 -0.2817 -0.2084 0.3612 0.0535 0.3127 -0.0313 -0.2596 -0.1030 -0.1342 0.1218 -0.1675 0.2230 0.2364 -0.1262 -0.2038 -0.1267 -0.0909 -0.1489 0.0893 0.0840 0.0947 0.1017 0.0752 0.0932 0.0959 0.0980 0.0979 0.1234 0.1350 0.1261 0.1293 0.1188 0.1271 0.1292 0.1261 0.1254
va: 1.2897 1.2630 1.1244 2.1356 2.1201 2.1198 3.1156 3.7552 3.8238 3.8827 3.9075 3.9219 3.9236 4.2332 4.2542 3.8310 3.6772 4.0213 3.9227 3.9760 3.8165 3.9225 4.1102 3.8394 3.8986 4.0218 3.9600 3.9543 3.9909 1.0494 1.0347 1.0044 1.0025 1.0104 0.9967 1.0137 1.0036 1.0305 1.0166 1.0215 1.0137 1.0070 1.0079 1.0133 0.9977 0.9981 1.0009
dispcorr: -0.025612277 hartree
energy: -2149.939181097991
dipole: 5.48367 -6.37590 -0.89223 -17.90569 17.25068 -0.65502 -10.37142 9.50436 -0.86706
magnitude: 1.40603 au
magnitude: 3.57384 debye
