program: Orca
programVersion: 5.0.2
elementType: Cl Cl F O O O N C C C C C C C C C C C C C C C C C C C C C C H H H H H H H H H H H H H H H H H H
charge: 0
multiplicity: 1
keywords: wb97x-d3
keywords: def2-TZVPP
keywords: def2/J RIJCOSX
keywords: DEFGRID2
keywords: scfconv7
keywords: smallprint printgap noloewdin
keywords: NOSOSCF
formula: C22H18Cl2FNO3
InChI: InChI=1/C22H18Cl2FNO3/c1-22(2)15(11-19(23)24)20(22)21(27)29-18(12-26)13-8-9-16(25)17(10-13)28-14-6-4-3-5-7-14/h3-11,15,18,20H,1-2H3
47 atoms
Cl -4.854939 1.853624 1.344888
Cl -5.446904 4.262562 -0.123657
F  4.192842 -3.187855 -1.871546
O  1.268835 1.924479 0.056027
O  -0.096617 0.332081 0.836039
O  2.920694 -3.500905 0.451508
N  4.128795 3.260286 1.019407
C  -1.689336 1.045922 -1.769433
C  -2.363551 1.638253 -0.567747
C  -0.88649 1.890847 -0.79837
C  -1.909258 1.648938 -3.136793
C  -1.517665 -0.453428 -1.812534
C  -3.310103 2.755729 -0.669276
C  0.092045 1.278871 0.122237
C  -4.387931 2.92557 0.087322
C  2.34558 1.363185 0.804208
C  2.912514 0.14794 0.114189
C  3.336871 2.434679 0.919398
C  2.667533 -1.111347 0.641026
C  3.61705 0.278196 -1.076582
C  3.102566 -2.247203 -0.025701
C  4.065514 -0.849164 -1.742284
C  3.792586 -2.099037 -1.22188
C  1.687927 -3.887439 0.901896
C  0.503503 -3.371733 0.393318
C  1.668481 -4.869539 1.881687
C  -0.704638 -3.844809 0.882513
C  0.453043 -5.338834 2.352274
C  -0.738877 -4.826999 1.85988
H  -2.569275 0.928689 0.225422
H  -0.606096 2.871586 -1.165647
H  -1.099046 1.360925 -3.808009
H  -2.844073 1.289243 -3.569126
H  -1.945113 2.737502 -3.127561
H  -1.464913 -0.903218 -0.823855
H  -2.364481 -0.900355 -2.335272
H  -0.612589 -0.726177 -2.359221
H  -3.128999 3.513736 -1.421109
H  2.015569 1.100338 1.81424
H  2.111507 -1.217871 1.563658
H  3.826159 1.257216 -1.488298
H  4.616956 -0.767266 -2.669059
H  0.511776 -2.607078 -0.372116
H  2.602115 -5.260873 2.263646
H  -1.626859 -3.438307 0.488803
H  0.440627 -6.105747 3.115268
H  -1.68573 -5.190645 2.23445
totalener: -2149.91322617 hartree
nucrepener: 2950.23742426 hartree
electener: -5100.15065043 hartree
oneelecener: -8813.32581655 hartree
twoeener: 3713.17516612 hartree
kineticenergy: 2143.53069659 hartree
xcener: -159.168983308155 hartree
chargesum: -0.0000000
charge: -0.037505 -0.042242 -0.181005 -0.253047 -0.381168 -0.291734 0.000895 0.084001 0.038522 -0.087898 -0.253226 -0.253857 -0.206053 0.359207 0.054051 0.314665 -0.012549 -0.259799 -0.125271 -0.154526 0.151738 -0.155718 0.204727 0.239859 -0.131531 -0.206551 -0.108228 -0.092598 -0.143901 0.088012 0.084543 0.095328 0.101453 0.076274 0.075682 0.097238 0.095242 0.097088 0.120966 0.132789 0.125160 0.129129 0.116295 0.126739 0.118135 0.125999 0.124670
qa: -0.0375 -0.0422 -0.1810 -0.2530 -0.3812 -0.2917 0.0009 0.0840 0.0385 -0.0879 -0.2532 -0.2539 -0.2061 0.3592 0.0541 0.3147 -0.0125 -0.2598 -0.1253 -0.1545 0.1517 -0.1557 0.2047 0.2399 -0.1315 -0.2066 -0.1082 -0.0926 -0.1439 0.0880 0.0845 0.0953 0.1015 0.0763 0.0757 0.0972 0.0952 0.0971 0.1210 0.1328 0.1252 0.1291 0.1163 0.1267 0.1181 0.1260 0.1247
va: 1.2902 1.2629 1.1233 2.1394 2.1155 2.1260 3.1163 3.7365 3.8352 3.8631 3.9137 3.9232 3.9270 4.2311 4.2560 3.8437 3.6468 4.0195 3.9204 3.9834 3.8009 3.9116 4.1107 3.8474 3.9188 4.0229 3.9644 3.9466 3.9825 1.0481 1.0342 1.0037 1.0019 1.0101 1.0208 1.0051 0.9990 1.0322 1.0154 1.0179 1.0146 1.0065 1.0043 1.0134 1.0027 0.9986 1.0008
dispcorr: -0.025532507 hartree
energy: -2149.938758673353
dipole: 6.84227 -7.71790 -0.87563 -16.07204 15.56011 -0.51193 -10.90237 10.00713 -0.89524
magnitude: 1.35287 au
magnitude: 3.43872 debye
