program: Orca
programVersion: 5.0.2
elementType: Cl Cl F O O O N C C C C C C C C C C C C C C C C C C C C C C H H H H H H H H H H H H H H H H H H
charge: 0
multiplicity: 1
keywords: wb97x-d3
keywords: def2-TZVPP
keywords: def2/J RIJCOSX
keywords: DEFGRID2
keywords: scfconv7
keywords: smallprint printgap noloewdin
keywords: NOSOSCF
formula: C22H18Cl2FNO3
InChI: InChI=1/C22H18Cl2FNO3/c1-22(2)15(11-19(23)24)20(22)21(27)29-18(12-26)13-8-9-16(25)17(10-13)28-14-6-4-3-5-7-14/h3-11,15,18,20H,1-2H3
47 atoms
Cl -2.888972 3.08939 -2.536248
Cl -5.378896 4.224856 -1.617874
F  4.552453 -1.872832 2.546104
O  -0.07143 0.603074 -0.840317
O  0.848763 2.602969 -0.438042
O  2.377277 -3.253651 1.924603
N  0.537292 -1.677343 -3.163922
C  -1.53193 2.857719 1.590712
C  -1.853979 3.592639 0.333151
C  -1.401413 2.154773 0.248322
C  -2.669635 2.369258 2.455572
C  -0.310858 3.262584 2.379429
C  -3.243944 3.950071 -0.026676
C  -0.090435 1.858409 -0.358425
C  -3.767287 3.776033 -1.232886
C  1.154975 0.156951 -1.408213
C  2.083715 -0.391755 -0.354958
C  0.790604 -0.868574 -2.388805
C  1.778981 -1.594893 0.272224
C  3.213376 0.320343 0.016908
C  2.615279 -2.105825 1.250628
C  4.049782 -0.177181 1.005366
C  3.750247 -1.380665 1.605901
C  1.816434 -4.324641 1.280842
C  0.901202 -5.078204 1.999427
C  2.173227 -4.686138 -0.011735
C  0.336336 -6.201668 1.415961
C  1.589951 -5.804617 -0.586503
C  0.672676 -6.567124 0.12119
H  -1.103407 4.312589 0.015153
H  -2.166555 1.415721 0.041578
H  -2.351071 1.518822 3.059862
H  -2.996833 3.154786 3.139685
H  -3.535103 2.054071 1.87216
H  0.095487 2.413126 2.930833
H  0.482418 3.669651 1.757979
H  -0.587306 4.026024 3.108726
H  -3.871034 4.408579 0.729125
H  1.647591 0.97266 -1.946163
H  0.893111 -2.150694 -0.012622
H  3.441622 1.267068 -0.453156
H  4.938248 0.360815 1.307164
H  0.641368 -4.783895 3.00787
H  2.894681 -4.105302 -0.571856
H  -0.376454 -6.789912 1.978475
H  1.861631 -6.080464 -1.596753
H  0.223674 -7.439274 -0.333912
totalener: -2149.91294775 hartree
nucrepener: 2919.67180433 hartree
electener: -5069.58475207 hartree
oneelecener: -8752.78503024 hartree
twoeener: 3683.20027816 hartree
kineticenergy: 2143.53284661 hartree
xcener: -159.168467001729 hartree
chargesum: 0.0000000
charge: -0.028956 -0.038035 -0.182285 -0.258241 -0.386039 -0.289252 -0.001949 0.110714 -0.015700 -0.162043 -0.268749 -0.250389 -0.245831 0.383330 0.091558 0.335661 -0.011327 -0.268632 -0.178158 -0.109813 0.156879 -0.152880 0.191067 0.253319 -0.214801 -0.166715 -0.087206 -0.103460 -0.144667 0.108948 0.107448 0.097268 0.093832 0.089070 0.091527 0.102062 0.087019 0.119330 0.121079 0.135372 0.121701 0.127657 0.125947 0.132670 0.125991 0.129446 0.126233
qa: -0.0290 -0.0380 -0.1823 -0.2582 -0.3860 -0.2893 -0.0019 0.1107 -0.0157 -0.1620 -0.2687 -0.2504 -0.2458 0.3833 0.0916 0.3357 -0.0113 -0.2686 -0.1782 -0.1098 0.1569 -0.1529 0.1911 0.2533 -0.2148 -0.1667 -0.0872 -0.1035 -0.1447 0.1089 0.1074 0.0973 0.0938 0.0891 0.0915 0.1021 0.0870 0.1193 0.1211 0.1354 0.1217 0.1277 0.1259 0.1327 0.1260 0.1294 0.1262
va: 1.3041 1.2677 1.1212 2.1302 2.1167 2.1226 3.1153 3.7298 3.8416 3.8903 3.9154 3.9010 3.9069 4.1606 4.2069 3.8303 3.6862 4.0272 3.9711 3.9269 3.7837 3.9226 4.0986 3.7916 4.0415 3.9425 3.9329 3.9543 3.9677 1.0252 1.0247 1.0060 1.0015 1.0009 1.0015 1.0200 1.0028 1.0169 1.0193 1.0130 1.0188 1.0069 1.0132 1.0028 0.9987 0.9998 1.0003
dispcorr: -0.024535858 hartree
energy: -2149.937483605559
dipole: 7.16573 -7.40104 -0.23531 -10.33871 10.94664 0.60793 20.10681 -18.91273 1.19407
magnitude: 1.36043 au
magnitude: 3.45793 debye
