program: Orca
programVersion: 5.0.2
elementType: Cl Cl F O O O N C C C C C C C C C C C C C C C C C C C C C C H H H H H H H H H H H H H H H H H H
charge: 0
multiplicity: 1
keywords: wb97x-d3
keywords: def2-TZVPP
keywords: def2/J RIJCOSX
keywords: DEFGRID2
keywords: scfconv7
keywords: smallprint printgap noloewdin
keywords: NOSOSCF
formula: C22H18Cl2FNO3
InChI: InChI=1/C22H18Cl2FNO3/c1-22(2)15(11-19(23)24)20(22)21(27)29-18(12-26)13-8-9-16(25)17(10-13)28-14-6-4-3-5-7-14/h3-11,15,18,20H,1-2H3
47 atoms
Cl -4.725778 2.718798 1.321586
Cl -5.228609 4.563774 -0.837087
F  4.51238 -3.515316 -1.267222
O  1.200371 1.671272 -0.424929
O  -0.143129 0.531232 0.957178
O  2.965751 -3.483598 0.903229
N  3.969333 3.374059 0.192505
C  -2.039705 0.506643 -1.526619
C  -2.478764 1.569847 -0.565455
C  -1.033554 1.526033 -1.027252
C  -2.414135 0.611513 -2.9864
C  -2.006622 -0.919255 -1.032415
C  -3.322988 2.6983 -0.977581
C  0.011169 1.172772 -0.046235
C  -4.292345 3.245513 -0.253992
C  2.322383 1.357349 0.399404
C  2.960098 0.061383 -0.03312
C  3.238409 2.492033 0.273151
C  2.658816 -1.103571 0.660276
C  3.79641 0.013061 -1.14142
C  3.180507 -2.320404 0.245518
C  4.32962 -1.195501 -1.554845
C  4.012704 -2.349539 -0.86729
C  1.706757 -3.805896 1.330054
C  1.613088 -4.516633 2.517219
C  0.567585 -3.492652 0.600889
C  0.368423 -4.918102 2.974928
C  -0.671374 -3.892809 1.076948
C  -0.779288 -4.604679 2.261715
H  -2.629346 1.223618 0.450713
H  -0.730999 2.269647 -1.755575
H  -1.750202 -0.008292 -3.590299
H  -3.434591 0.259972 -3.145737
H  -2.348687 1.626162 -3.376905
H  -1.252051 -1.495669 -1.572218
H  -1.795678 -1.000458 0.030738
H  -2.973848 -1.388926 -1.218991
H  -3.151356 3.134346 -1.953723
H  2.017769 1.290992 1.448162
H  2.004002 -1.070679 1.521997
H  4.047709 0.91659 -1.681611
H  4.98728 -1.250212 -2.411692
H  2.512778 -4.754902 3.068948
H  0.638535 -2.945828 -0.330386
H  0.297959 -5.474928 3.899796
H  -1.558796 -3.648624 0.507907
H  -1.749413 -4.914548 2.625101
totalener: -2149.91384463 hartree
nucrepener: 2936.45903101 hartree
electener: -5086.37287564 hartree
oneelecener: -8785.72949344 hartree
twoeener: 3699.35661781 hartree
kineticenergy: 2143.52710788 hartree
xcener: -159.168215610839 hartree
chargesum: -0.0000000
charge: -0.037158 -0.042201 -0.181225 -0.255225 -0.385428 -0.290578 -0.000501 0.092661 0.041370 -0.101612 -0.246243 -0.296851 -0.204607 0.373795 0.052093 0.309013 -0.024889 -0.255723 -0.120041 -0.146890 0.143498 -0.156072 0.202763 0.241468 -0.213119 -0.143713 -0.084781 -0.113687 -0.151165 0.090007 0.083529 0.094255 0.101562 0.076139 0.089469 0.109069 0.098456 0.096840 0.124082 0.140116 0.124806 0.129238 0.127987 0.122655 0.126946 0.134692 0.125200
qa: -0.0372 -0.0422 -0.1812 -0.2552 -0.3854 -0.2906 -0.0005 0.0927 0.0414 -0.1016 -0.2462 -0.2969 -0.2046 0.3738 0.0521 0.3090 -0.0249 -0.2557 -0.1200 -0.1469 0.1435 -0.1561 0.2028 0.2415 -0.2131 -0.1437 -0.0848 -0.1137 -0.1512 0.0900 0.0835 0.0943 0.1016 0.0761 0.0895 0.1091 0.0985 0.0968 0.1241 0.1401 0.1248 0.1292 0.1280 0.1227 0.1269 0.1347 0.1252
va: 1.2905 1.2628 1.1231 2.1325 2.1114 2.1226 3.1139 3.7447 3.8340 3.8914 3.9089 3.9226 3.9230 4.2120 4.2563 3.8328 3.7184 4.0193 3.8946 3.9897 3.8033 3.9192 4.1102 3.8413 4.0361 3.9336 3.9421 3.9438 3.9963 1.0480 1.0350 1.0042 1.0022 1.0104 0.9955 1.0112 1.0021 1.0318 1.0188 1.0190 1.0150 1.0069 1.0130 1.0031 0.9981 0.9937 1.0015
dispcorr: -0.025307685 hartree
energy: -2149.939152313027
dipole: 3.22495 -4.17168 -0.94672 -22.26186 21.30844 -0.95341 -6.94000 6.21798 -0.72202
magnitude: 1.52532 au
magnitude: 3.87705 debye
