program: Orca
programVersion: 5.0.2
elementType: Cl Cl F O O O N C C C C C C C C C C C C C C C C C C C C C C H H H H H H H H H H H H H H H H H H
charge: 0
multiplicity: 1
keywords: wb97x-d3
keywords: def2-TZVPP
keywords: def2/J RIJCOSX
keywords: DEFGRID2
keywords: scfconv7
keywords: smallprint printgap noloewdin
keywords: NOSOSCF
formula: C22H18Cl2FNO3
InChI: InChI=1/C22H18Cl2FNO3/c1-22(2)15(11-19(23)24)20(22)21(27)29-18(12-26)13-8-9-16(25)17(10-13)28-14-6-4-3-5-7-14/h3-11,15,18,20H,1-2H3
47 atoms
Cl -2.970704 3.113596 -2.479744
Cl -5.42549 4.213588 -1.436789
F  4.293385 -1.762766 2.771897
O  -0.06021 0.545753 -0.984405
O  0.815022 2.551738 -0.516144
O  2.210215 -3.208497 1.986556
N  0.733629 -1.725728 -3.274586
C  -1.518846 2.61323 1.578256
C  -1.860634 3.451279 0.391387
C  -1.413345 2.027868 0.176757
C  -2.640233 2.053951 2.420691
C  -0.280085 2.942422 2.374341
C  -3.255445 3.837472 0.084087
C  -0.106368 1.783241 -0.458796
C  -3.80776 3.734926 -1.117518
C  1.202099 0.123737 -1.489547
C  2.069992 -0.401797 -0.374681
C  0.917075 -0.909507 -2.487615
C  1.730641 -1.595914 0.252338
C  3.156162 0.334776 0.070016
C  2.486923 -2.070173 1.310823
C  3.910256 -0.124923 1.139809
C  3.573818 -1.315049 1.746512
C  1.683855 -4.283006 1.318155
C  0.658092 -4.975671 1.941219
C  2.179316 -4.700942 0.089966
C  0.12342 -6.097972 1.326851
C  1.626316 -5.816685 -0.518183
C  0.598987 -6.519295 0.094533
H  -1.115101 4.196702 0.124484
H  -2.180285 1.30549 -0.076752
H  -3.522819 1.802972 1.831821
H  -2.315336 1.147649 2.933303
H  -2.94265 2.773614 3.184021
H  -0.535589 3.639835 3.173985
H  0.132037 2.045517 2.839767
H  0.503121 3.399089 1.775016
H  -3.860953 4.25822 0.878435
H  1.708949 0.948636 -1.999634
H  0.878284 -2.170208 -0.091582
H  3.410789 1.2732 -0.402698
H  4.761764 0.434209 1.503137
H  0.289239 -4.637424 2.900452
H  2.985948 -4.164136 -0.392582
H  -0.676058 -6.640051 1.814028
H  2.007149 -6.13799 -1.478294
H  0.173332 -7.389339 -0.386281
totalener: -2149.91256540 hartree
nucrepener: 2933.54920869 hartree
electener: -5083.46177409 hartree
oneelecener: -8780.51751936 hartree
twoeener: 3697.05574527 hartree
kineticenergy: 2143.54003669 hartree
xcener: -159.169718499584 hartree
chargesum: 0.0000000
charge: -0.028804 -0.038797 -0.182551 -0.258626 -0.383927 -0.289384 -0.001228 0.108929 -0.007438 -0.162075 -0.268330 -0.250946 -0.252238 0.378074 0.094161 0.337290 -0.008858 -0.270337 -0.171966 -0.117403 0.152453 -0.148546 0.188942 0.239629 -0.206906 -0.158655 -0.090773 -0.103590 -0.141017 0.108763 0.108907 0.088624 0.097651 0.093670 0.087573 0.090931 0.101866 0.119660 0.121310 0.134161 0.121005 0.127978 0.125531 0.132841 0.126330 0.129309 0.126804
qa: -0.0288 -0.0388 -0.1826 -0.2586 -0.3839 -0.2894 -0.0012 0.1089 -0.0074 -0.1621 -0.2683 -0.2509 -0.2522 0.3781 0.0942 0.3373 -0.0089 -0.2703 -0.1720 -0.1174 0.1525 -0.1485 0.1889 0.2396 -0.2069 -0.1587 -0.0908 -0.1036 -0.1410 0.1088 0.1089 0.0886 0.0977 0.0937 0.0876 0.0909 0.1019 0.1197 0.1213 0.1342 0.1210 0.1280 0.1255 0.1328 0.1263 0.1293 0.1268
va: 1.3039 1.2668 1.1208 2.1315 2.1176 2.1200 3.1165 3.7342 3.8333 3.8892 3.9139 3.8997 3.9098 4.1691 4.2056 3.8307 3.6898 4.0315 3.9618 3.9260 3.7831 3.9190 4.0998 3.8017 4.0409 3.9472 3.9348 3.9548 3.9648 1.0256 1.0240 1.0009 1.0060 1.0017 1.0034 1.0015 1.0199 1.0172 1.0191 1.0149 1.0193 1.0066 1.0130 1.0024 0.9988 0.9999 1.0002
dispcorr: -0.024823383 hartree
energy: -2149.937388782666
dipole: 7.86231 -8.10492 -0.24262 -12.04766 12.54953 0.50187 19.30285 -18.09231 1.21055
magnitude: 1.33273 au
magnitude: 3.38752 debye
