program: Orca
programVersion: 5.0.2
elementType: Cl Cl F O O O N C C C C C C C C C C C C C C C C C C C C C C H H H H H H H H H H H H H H H H H H
charge: 0
multiplicity: 1
keywords: wb97x-d3
keywords: def2-TZVPP
keywords: def2/J RIJCOSX
keywords: DEFGRID2
keywords: scfconv7
keywords: smallprint printgap noloewdin
keywords: NOSOSCF
formula: C22H18Cl2FNO3
InChI: InChI=1/C22H18Cl2FNO3/c1-22(2)15(11-19(23)24)20(22)21(27)29-18(12-26)13-8-9-16(25)17(10-13)28-14-6-4-3-5-7-14/h3-11,15,18,20H,1-2H3
47 atoms
Cl -2.906014 3.218031 -2.523894
Cl -5.352918 4.391972 -1.543824
F  4.485762 -1.822806 2.5009
O  -0.105648 0.656198 -0.900712
O  0.861596 2.636574 -0.514738
O  2.260645 -3.162773 1.93287
N  0.436343 -1.644606 -3.21883
C  -1.463752 2.927655 1.569859
C  -1.799238 3.679081 0.325448
C  -1.381369 2.232256 0.219536
C  -2.589585 2.458543 2.460318
C  -0.214218 3.29657 2.331575
C  -3.18933 4.06732 -0.000937
C  -0.090689 1.911086 -0.41639
C  -3.740936 3.91386 -1.197304
C  1.106422 0.186109 -1.479427
C  2.03499 -0.365657 -0.427955
C  0.715179 -0.839423 -2.448829
C  1.706814 -1.543639 0.233315
C  3.184272 0.328543 -0.081628
C  2.535526 -2.043669 1.223519
C  4.015822 -0.160239 0.914548
C  3.690165 -1.338545 1.551572
C  1.812009 -4.286556 1.292588
C  0.931921 -5.093477 1.997895
C  2.240175 -4.64706 0.021955
C  0.476691 -6.269768 1.424293
C  1.766736 -5.821566 -0.542793
C  0.886457 -6.637379 0.151298
H  -1.040939 4.384896 -0.005412
H  -2.167426 1.511962 0.025595
H  -2.275051 1.596252 3.049556
H  -2.879847 3.245843 3.158825
H  -3.477448 2.16841 1.898104
H  0.186838 2.431687 2.862447
H  0.572272 3.693691 1.69522
H  -0.454762 4.056915 3.076595
H  -3.791221 4.530906 0.771934
H  1.606708 0.989742 -2.028497
H  0.807074 -2.088491 -0.028871
H  3.430533 1.257319 -0.577627
H  4.918349 0.365553 1.195146
H  0.614327 -4.798502 2.989243
H  2.934274 -4.025503 -0.528541
H  -0.209074 -6.898312 1.976588
H  2.095692 -6.098122 -1.535484
H  0.522964 -7.551774 -0.296914
totalener: -2149.91276067 hartree
nucrepener: 2918.49820878 hartree
electener: -5068.41096944 hartree
oneelecener: -8750.40481226 hartree
twoeener: 3681.99384281 hartree
kineticenergy: 2143.53963919 hartree
xcener: -159.169378678644 hartree
chargesum: 0.0000000
charge: -0.028859 -0.038069 -0.181676 -0.258378 -0.385901 -0.291722 -0.000286 0.110672 -0.015196 -0.161868 -0.269255 -0.250005 -0.246084 0.383195 0.091522 0.334224 -0.010132 -0.268879 -0.169033 -0.103665 0.143115 -0.157122 0.197156 0.249936 -0.214423 -0.155504 -0.087385 -0.109843 -0.145576 0.109347 0.107504 0.097423 0.094050 0.088972 0.091563 0.101710 0.087163 0.119516 0.121144 0.135222 0.121386 0.127740 0.125374 0.130113 0.125749 0.128876 0.126191
qa: -0.0289 -0.0381 -0.1817 -0.2584 -0.3859 -0.2917 -0.0003 0.1107 -0.0152 -0.1619 -0.2693 -0.2500 -0.2461 0.3832 0.0915 0.3342 -0.0101 -0.2689 -0.1690 -0.1037 0.1431 -0.1571 0.1972 0.2499 -0.2144 -0.1555 -0.0874 -0.1098 -0.1456 0.1093 0.1075 0.0974 0.0941 0.0890 0.0916 0.1017 0.0872 0.1195 0.1211 0.1352 0.1214 0.1277 0.1254 0.1301 0.1257 0.1289 0.1262
va: 1.3044 1.2677 1.1223 2.1311 2.1168 2.1195 3.1163 3.7312 3.8425 3.8909 3.9154 3.9008 3.9076 4.1593 4.2072 3.8335 3.6757 4.0276 3.9758 3.9221 3.7856 3.9230 4.1037 3.7950 4.0373 3.9303 3.9377 3.9626 3.9685 1.0250 1.0247 1.0060 1.0014 1.0009 1.0015 1.0201 1.0029 1.0168 1.0193 1.0136 1.0184 1.0069 1.0136 1.0044 0.9986 1.0001 1.0003
dispcorr: -0.024543968 hartree
energy: -2149.937304633510
dipole: 8.28488 -8.41889 -0.13400 -11.04243 11.68043 0.63799 19.92340 -18.72974 1.19366
magnitude: 1.36008 au
magnitude: 3.45705 debye
