program: Orca
programVersion: 5.0.2
elementType: Cl Cl F O O O N C C C C C C C C C C C C C C C C C C C C C C H H H H H H H H H H H H H H H H H H
charge: 0
multiplicity: 1
keywords: wb97x-d3
keywords: def2-TZVPP
keywords: def2/J RIJCOSX
keywords: DEFGRID2
keywords: scfconv7
keywords: smallprint printgap noloewdin
keywords: NOSOSCF
formula: C22H18Cl2FNO3
InChI: InChI=1/C22H18Cl2FNO3/c1-22(2)15(11-19(23)24)20(22)21(27)29-18(12-26)13-8-9-16(25)17(10-13)28-14-6-4-3-5-7-14/h3-11,15,18,20H,1-2H3
47 atoms
Cl -2.600036 3.404176 -2.309029
Cl -5.333233 3.911476 -1.532951
F  4.744165 -2.253401 2.384293
O  0.298417 0.537316 -1.083185
O  0.77389 2.32796 0.170791
O  2.536461 -3.403702 1.543891
N  1.765593 -0.917651 -3.669398
C  -1.945765 1.485547 1.54068
C  -2.129323 2.691762 0.680225
C  -1.462512 1.471933 0.098016
C  -3.142245 0.606991 1.821088
C  -0.963229 1.545753 2.683394
C  -3.470116 3.102327 0.207399
C  -0.025977 1.530656 -0.23399
C  -3.759914 3.424878 -1.045939
C  1.670383 0.433507 -1.433758
C  2.484053 -0.265852 -0.373246
C  1.703336 -0.32405 -2.68809
C  2.079774 -1.519235 0.080894
C  3.630008 0.324709 0.124918
C  2.838883 -2.194765 1.021229
C  4.400062 -0.348754 1.0641
C  4.00652 -1.593243 1.494703
C  1.517787 -4.136839 0.989103
C  0.35307 -4.309118 1.718153
C  1.675512 -4.726874 -0.25625
C  -0.667532 -5.087862 1.191642
C  0.645701 -5.495694 -0.774969
C  -0.526571 -5.678266 -0.054825
H  -1.449849 3.515257 0.88738
H  -2.053255 0.86303 -0.576396
H  -3.830706 0.557052 0.9772
H  -2.823191 -0.411193 2.047716
H  -3.699253 0.9774 2.683892
H  -0.559166 0.555428 2.900174
H  -0.126834 2.213681 2.492942
H  -1.470877 1.89819 3.58299
H  -4.270296 3.170889 0.935275
H  2.096156 1.423563 -1.626768
H  1.175566 -1.970783 -0.308325
H  3.930882 1.307954 -0.210518
H  5.304394 0.089644 1.46374
H  0.255058 -3.845671 2.691072
H  2.594043 -4.587463 -0.811958
H  -1.577066 -5.23003 1.760057
H  0.763606 -5.956732 -1.746283
H  -1.325408 -6.282089 -0.463408
totalener: -2149.91230750 hartree
nucrepener: 2959.75180644 hartree
electener: -5109.66411394 hartree
oneelecener: -8832.84382000 hartree
twoeener: 3723.17970606 hartree
kineticenergy: 2143.53339069 hartree
xcener: -159.167280468891 hartree
chargesum: -0.0000000
charge: -0.029370 -0.039178 -0.184641 -0.266918 -0.368878 -0.283768 -0.002140 0.109276 -0.005039 -0.164688 -0.267661 -0.247164 -0.249809 0.361028 0.092968 0.323655 -0.003548 -0.257257 -0.183732 -0.128314 0.177866 -0.136263 0.187477 0.211964 -0.168287 -0.156666 -0.117075 -0.115250 -0.120628 0.107785 0.107823 0.089661 0.094547 0.094230 0.088042 0.102048 0.088005 0.118299 0.121461 0.132002 0.111100 0.124683 0.126510 0.135925 0.127429 0.132604 0.129884
qa: -0.0294 -0.0392 -0.1846 -0.2669 -0.3689 -0.2838 -0.0021 0.1093 -0.0050 -0.1647 -0.2677 -0.2472 -0.2498 0.3610 0.0930 0.3237 -0.0035 -0.2573 -0.1837 -0.1283 0.1779 -0.1363 0.1875 0.2120 -0.1683 -0.1567 -0.1171 -0.1153 -0.1206 0.1078 0.1078 0.0897 0.0945 0.0942 0.0880 0.1020 0.0880 0.1183 0.1215 0.1320 0.1111 0.1247 0.1265 0.1359 0.1274 0.1326 0.1299
va: 1.3024 1.2664 1.1166 2.1209 2.1357 2.1216 3.1212 3.7377 3.8333 3.8787 3.9136 3.9023 3.9081 4.1936 4.2069 3.8329 3.7475 4.0245 3.9252 3.9660 3.7712 3.9200 4.0859 3.8243 4.0211 3.9866 3.9413 3.9488 3.9435 1.0269 1.0241 1.0003 1.0070 1.0015 1.0026 1.0198 1.0028 1.0175 1.0211 1.0255 1.0140 1.0077 1.0103 1.0034 0.9995 0.9990 0.9993
dispcorr: -0.024929273 hartree
energy: -2149.937236774475
dipole: -0.04551 -0.83289 -0.87840 -17.33038 17.32571 -0.00468 19.23043 -17.93027 1.30015
magnitude: 1.56907 au
magnitude: 3.98827 debye
