program: Orca
programVersion: 5.0.2
elementType: Cl Cl F O O O N C C C C C C C C C C C C C C C C C C C C C C H H H H H H H H H H H H H H H H H H
charge: 0
multiplicity: 1
keywords: wb97x-d3
keywords: def2-TZVPP
keywords: def2/J RIJCOSX
keywords: DEFGRID2
keywords: scfconv7
keywords: smallprint printgap noloewdin
keywords: NOSOSCF
formula: C22H18Cl2FNO3
InChI: InChI=1/C22H18Cl2FNO3/c1-22(2)15(11-19(23)24)20(22)21(27)29-18(12-26)13-8-9-16(25)17(10-13)28-14-6-4-3-5-7-14/h3-11,15,18,20H,1-2H3
47 atoms
Cl -2.926061 3.183774 -2.506494
Cl -5.388807 4.322719 -1.524287
F  4.532771 -1.777978 2.525498
O  -0.078449 0.651403 -0.893597
O  0.844692 2.649361 -0.488605
O  2.343297 -3.151764 1.931352
N  0.532248 -1.626608 -3.218416
C  -1.498761 2.863778 1.587882
C  -1.834901 3.632146 0.353716
C  -1.394606 2.194438 0.225832
C  -2.624947 2.362104 2.459866
C  -0.260967 3.237563 2.365948
C  -3.227917 4.006525 0.023739
C  -0.093133 1.903792 -0.40298
C  -3.773697 3.856138 -1.17575
C  1.148337 0.207515 -1.462185
C  2.076925 -0.334576 -0.405403
C  0.786633 -0.819312 -2.441945
C  1.763197 -1.523678 0.243805
C  3.211931 0.375497 -0.046572
C  2.594014 -2.019878 1.234368
C  4.044814 -0.109067 0.951202
C  3.734862 -1.297518 1.575695
C  1.796625 -4.234172 1.294034
C  0.83283 -4.952361 1.984105
C  2.214362 -4.636819 0.032569
C  0.281072 -6.083654 1.402805
C  1.645213 -5.763007 -0.540612
C  0.679033 -6.490571 0.13844
H  -1.084732 4.355489 0.04276
H  -2.167611 1.465426 0.012924
H  -2.931322 3.13116 3.1717
H  -3.504273 2.071768 1.884412
H  -2.303301 1.492171 3.033854
H  0.524931 3.655353 1.742233
H  -0.517724 3.98276 3.120801
H  0.147704 2.369914 2.886402
H  -3.837927 4.457531 0.797774
H  1.639207 1.023816 -2.000979
H  0.873695 -2.078902 -0.030788
H  3.446826 1.311784 -0.533855
H  4.937247 0.428197 1.242153
H  0.525262 -4.625698 2.968706
H  2.973505 -4.081317 -0.502859
H  -0.47027 -6.644778 1.942223
H  1.965325 -6.072614 -1.526402
H  0.240618 -7.36867 -0.315408
totalener: -2149.91292455 hartree
nucrepener: 2922.90384438 hartree
electener: -5072.81676893 hartree
oneelecener: -8759.24422633 hartree
twoeener: 3686.42745740 hartree
kineticenergy: 2143.53743590 hartree
xcener: -159.169047121564 hartree
chargesum: 0.0000000
charge: -0.028837 -0.038338 -0.182274 -0.258478 -0.385136 -0.290407 -0.001403 0.109424 -0.012577 -0.162784 -0.268831 -0.250319 -0.247873 0.382506 0.092370 0.334985 -0.012986 -0.268656 -0.164549 -0.107466 0.143410 -0.153906 0.194217 0.238958 -0.208400 -0.154477 -0.090346 -0.105831 -0.141488 0.108903 0.107875 0.093818 0.088915 0.097444 0.102096 0.087115 0.091395 0.119434 0.120749 0.134322 0.120849 0.127405 0.125716 0.131867 0.126231 0.129015 0.126343
qa: -0.0288 -0.0383 -0.1823 -0.2585 -0.3851 -0.2904 -0.0014 0.1094 -0.0126 -0.1628 -0.2688 -0.2503 -0.2479 0.3825 0.0924 0.3350 -0.0130 -0.2687 -0.1645 -0.1075 0.1434 -0.1539 0.1942 0.2390 -0.2084 -0.1545 -0.0903 -0.1058 -0.1415 0.1089 0.1079 0.0938 0.0889 0.0974 0.1021 0.0871 0.0914 0.1194 0.1207 0.1343 0.1208 0.1274 0.1257 0.1319 0.1262 0.1290 0.1263
va: 1.3042 1.2673 1.1212 2.1310 2.1175 2.1187 3.1162 3.7321 3.8391 3.8907 3.9150 3.9009 3.9079 4.1621 4.2064 3.8323 3.6867 4.0278 3.9616 3.9237 3.7887 3.9233 4.0976 3.8029 4.0382 3.9400 3.9349 3.9563 3.9645 1.0254 1.0245 1.0016 1.0009 1.0060 1.0199 1.0030 1.0015 1.0169 1.0194 1.0143 1.0185 1.0069 1.0129 1.0030 0.9987 0.9999 1.0003
dispcorr: -0.024594168 hartree
energy: -2149.937518718937
dipole: 7.61211 -7.82039 -0.20827 -10.93879 11.51745 0.57866 19.89516 -18.69559 1.19957
magnitude: 1.34803 au
magnitude: 3.42643 debye
