program: Orca
programVersion: 5.0.2
elementType: Cl Cl F O O O N C C C C C C C C C C C C C C C C C C C C C C H H H H H H H H H H H H H H H H H H
charge: 0
multiplicity: 1
keywords: wb97x-d3
keywords: def2-TZVPP
keywords: def2/J RIJCOSX
keywords: DEFGRID2
keywords: scfconv7
keywords: smallprint printgap noloewdin
keywords: NOSOSCF
formula: C22H18Cl2FNO3
InChI: InChI=1/C22H18Cl2FNO3/c1-22(2)15(11-19(23)24)20(22)21(27)29-18(12-26)13-8-9-16(25)17(10-13)28-14-6-4-3-5-7-14/h3-11,15,18,20H,1-2H3
47 atoms
Cl -2.733035 3.626115 -2.441209
Cl -5.284227 4.502748 -1.413915
F  4.299202 -1.741968 2.762525
O  -0.044563 0.496314 -1.07629
O  0.787965 2.470905 -0.430071
O  2.209263 -3.177757 1.988723
N  0.89177 -1.731708 -3.351035
C  -1.653078 2.26664 1.562363
C  -1.898629 3.285349 0.500529
C  -1.473906 1.896935 0.096047
C  -2.83636 1.625425 2.246356
C  -0.454898 2.426682 2.464939
C  -3.262842 3.757626 0.17702
C  -0.130015 1.69857 -0.477183
C  -3.701911 3.93884 -1.061287
C  1.246681 0.117566 -1.539304
C  2.098967 -0.396249 -0.406351
C  1.025276 -0.916419 -2.553425
C  1.745545 -1.580263 0.232905
C  3.19046 0.334429 0.032834
C  2.494024 -2.049581 1.299404
C  3.937742 -0.120789 1.109319
C  3.587525 -1.299733 1.72905
C  1.619925 -4.234101 1.343674
C  0.555668 -4.854591 1.977494
C  2.093416 -4.703604 0.125632
C  -0.040237 -5.957483 1.383942
C  1.479604 -5.797931 -0.462363
C  0.412832 -6.428772 0.161436
H  -1.120269 4.036625 0.389779
H  -2.239006 1.244575 -0.308855
H  -3.685593 1.4875 1.576686
H  -2.563672 0.645274 2.639666
H  -3.171026 2.235696 3.087601
H  -0.738609 2.996872 3.351096
H  -0.089858 1.454848 2.801476
H  0.371634 2.947991 1.988487
H  -3.938807 3.996368 0.989655
H  1.745439 0.961545 -2.026199
H  0.888891 -2.149545 -0.10842
H  3.455036 1.265227 -0.449217
H  4.793434 0.434234 1.468964
H  0.204946 -4.476625 2.928728
H  2.930212 -4.222141 -0.36403
H  -0.870099 -6.443782 1.879155
H  1.84329 -6.159969 -1.414599
H  -0.060215 -7.28328 -0.302761
totalener: -2149.91264820 hartree
nucrepener: 2938.48436241 hartree
electener: -5088.39701061 hartree
oneelecener: -8790.37434845 hartree
twoeener: 3701.97733784 hartree
kineticenergy: 2143.53955490 hartree
xcener: -159.169367874030 hartree
chargesum: -0.0000000
charge: -0.030302 -0.038690 -0.182906 -0.258382 -0.376813 -0.288339 -0.001379 0.111627 -0.013638 -0.153520 -0.272205 -0.248299 -0.244394 0.368287 0.088713 0.337998 -0.010449 -0.269317 -0.174570 -0.114142 0.154305 -0.147406 0.187897 0.238422 -0.205168 -0.160303 -0.091565 -0.102665 -0.139853 0.110360 0.105888 0.088841 0.096606 0.094899 0.088588 0.091340 0.099530 0.119264 0.120318 0.133947 0.118158 0.127631 0.125193 0.133456 0.126166 0.129960 0.126913
qa: -0.0303 -0.0387 -0.1829 -0.2584 -0.3768 -0.2883 -0.0014 0.1116 -0.0136 -0.1535 -0.2722 -0.2483 -0.2444 0.3683 0.0887 0.3380 -0.0104 -0.2693 -0.1746 -0.1141 0.1543 -0.1474 0.1879 0.2384 -0.2052 -0.1603 -0.0916 -0.1027 -0.1399 0.1104 0.1059 0.0888 0.0966 0.0949 0.0886 0.0913 0.0995 0.1193 0.1203 0.1339 0.1182 0.1276 0.1252 0.1335 0.1262 0.1300 0.1269
va: 1.3024 1.2678 1.1202 2.1333 2.1266 2.1196 3.1177 3.7413 3.8406 3.8730 3.9125 3.8991 3.9076 4.1855 4.2090 3.8318 3.6854 4.0295 3.9498 3.9321 3.7812 3.9217 4.0970 3.8020 4.0410 3.9539 3.9332 3.9515 3.9631 1.0255 1.0247 1.0008 1.0064 1.0010 1.0035 1.0016 1.0194 1.0162 1.0178 1.0164 1.0192 1.0067 1.0129 1.0022 0.9989 0.9997 1.0003
dispcorr: -0.024987923 hartree
energy: -2149.937636120547
dipole: 5.47387 -5.84603 -0.37216 -16.40365 16.73469 0.33105 19.17171 -17.97055 1.20116
magnitude: 1.30034 au
magnitude: 3.30519 debye
