program: Orca
programVersion: 5.0.2
elementType: Cl Cl F O O O N C C C C C C C C C C C C C C C C C C C C C C H H H H H H H H H H H H H H H H H H
charge: 0
multiplicity: 1
keywords: wb97x-d3
keywords: def2-TZVPP
keywords: def2/J RIJCOSX
keywords: DEFGRID2
keywords: scfconv7
keywords: smallprint printgap noloewdin
keywords: NOSOSCF
formula: C22H18Cl2FNO3
InChI: InChI=1/C22H18Cl2FNO3/c1-22(2)15(11-19(23)24)20(22)21(27)29-18(12-26)13-8-9-16(25)17(10-13)28-14-6-4-3-5-7-14/h3-11,15,18,20H,1-2H3
47 atoms
Cl -1.599858 4.893099 -1.941243
Cl -4.334425 5.798716 -1.740235
F  2.814091 -2.864237 3.024976
O  0.156173 0.874964 -1.239619
O  0.597397 2.273307 0.448334
O  0.743387 -3.527616 1.385211
N  1.936652 -0.739603 -3.516913
C  -2.504249 1.713621 0.923247
C  -2.231375 3.118079 0.496949
C  -1.656642 1.985309 -0.311353
C  -3.865562 1.119088 0.652205
C  -1.865872 1.19724 2.189029
C  -3.28857 3.979009 -0.078165
C  -0.197813 1.766183 -0.292949
C  -3.099871 4.781939 -1.116693
C  1.525712 0.502044 -1.255071
C  1.882498 -0.402119 -0.10157
C  1.735471 -0.184898 -2.531763
C  1.172904 -1.582359 0.093039
C  2.903188 -0.05837 0.767676
C  1.480201 -2.412042 1.15424
C  3.2322 -0.892812 1.825414
C  2.517914 -2.056088 2.011498
C  1.306532 -4.756552 1.169105
C  2.43536 -4.947987 0.386221
C  0.657195 -5.836347 1.751703
C  2.915147 -6.236786 0.196816
C  1.145534 -7.11509 1.548097
C  2.278617 -7.323422 0.773331
H  -1.49656 3.648671 1.097834
H  -2.135876 1.753732 -1.255937
H  -3.802089 0.031916 0.591773
H  -4.558917 1.363255 1.459529
H  -4.301954 1.476707 -0.280874
H  -1.703706 0.119545 2.129963
H  -0.910053 1.668698 2.406873
H  -2.526564 1.384539 3.037133
H  -4.265738 3.987073 0.390284
H  2.168694 1.388511 -1.239601
H  0.370994 -1.869842 -0.576416
H  3.442757 0.869515 0.63339
H  4.025324 -0.635438 2.514091
H  2.937815 -4.113882 -0.086202
H  -0.222488 -5.666399 2.358325
H  3.79552 -6.384977 -0.414334
H  0.637724 -7.954918 2.003685
H  2.658492 -8.323924 0.61906
totalener: -2149.91199313 hartree
nucrepener: 2913.97996351 hartree
electener: -5063.89195664 hartree
oneelecener: -8741.25671519 hartree
twoeener: 3677.36475855 hartree
kineticenergy: 2143.54593486 hartree
xcener: -159.168557100804 hartree
chargesum: -0.0000000
charge: -0.031502 -0.038352 -0.183391 -0.261744 -0.362991 -0.300997 0.001644 0.114170 -0.014715 -0.151134 -0.272261 -0.249521 -0.243362 0.352462 0.088168 0.331393 0.003843 -0.260863 -0.178958 -0.084704 0.091296 -0.159205 0.254071 0.262280 -0.135401 -0.205486 -0.139151 -0.093760 -0.141367 0.110448 0.105879 0.097771 0.094858 0.088858 0.091498 0.099981 0.090015 0.119144 0.119862 0.127215 0.112972 0.128222 0.126180 0.121036 0.126953 0.123448 0.125196
qa: -0.0315 -0.0384 -0.1834 -0.2617 -0.3630 -0.3010 0.0016 0.1142 -0.0147 -0.1511 -0.2723 -0.2495 -0.2434 0.3525 0.0882 0.3314 0.0038 -0.2609 -0.1790 -0.0847 0.0913 -0.1592 0.2541 0.2623 -0.1354 -0.2055 -0.1392 -0.0938 -0.1414 0.1104 0.1059 0.0978 0.0949 0.0889 0.0915 0.1000 0.0900 0.1191 0.1199 0.1272 0.1130 0.1282 0.1262 0.1210 0.1270 0.1234 0.1252
va: 1.3007 1.2680 1.1191 2.1291 2.1437 2.0978 3.1179 3.7439 3.8400 3.8644 3.9121 3.8991 3.9103 4.2014 4.2082 3.8246 3.6369 4.0217 3.9996 3.9483 3.8603 3.9420 4.0507 3.7807 3.9093 4.0301 3.9868 3.9560 3.9590 1.0263 1.0247 1.0065 1.0010 1.0006 1.0021 1.0175 1.0041 1.0162 1.0169 1.0272 1.0142 1.0071 1.0107 1.0152 1.0005 0.9990 1.0002
dispcorr: -0.024981635 hartree
energy: -2149.936974764480
dipole: 0.17304 -0.67821 -0.50516 -28.10700 28.16119 0.05420 15.77271 -14.52185 1.25086
magnitude: 1.35011 au
magnitude: 3.43170 debye
