program: Orca
programVersion: 5.0.2
elementType: Cl Cl F O O O N C C C C C C C C C C C C C C C C C C C C C C H H H H H H H H H H H H H H H H H H
charge: 0
multiplicity: 1
keywords: wb97x-d3
keywords: def2-TZVPP
keywords: def2/J RIJCOSX
keywords: DEFGRID2
keywords: scfconv7
keywords: smallprint printgap noloewdin
keywords: NOSOSCF
formula: C22H18Cl2FNO3
InChI: InChI=1/C22H18Cl2FNO3/c1-22(2)15(11-19(23)24)20(22)21(27)29-18(12-26)13-8-9-16(25)17(10-13)28-14-6-4-3-5-7-14/h3-11,15,18,20H,1-2H3
47 atoms
Cl -3.066412 2.870254 -2.501558
Cl -5.519068 3.989056 -1.470404
F  4.756324 -1.772362 2.39079
O  -0.023323 0.637496 -0.811744
O  0.866847 2.685399 -0.652781
O  2.5886 -3.204179 1.858359
N  0.429865 -1.676561 -3.135121
C  -1.357946 3.095535 1.507435
C  -1.817156 3.672193 0.211349
C  -1.310048 2.248795 0.244089
C  -2.395248 2.66906 2.518883
C  -0.095101 3.629149 2.137534
C  -3.247901 3.940343 -0.055313
C  -0.04179 1.929492 -0.437585
C  -3.861159 3.641304 -1.19268
C  1.166078 0.168757 -1.438397
C  2.145076 -0.361946 -0.422253
C  0.741834 -0.86746 -2.382292
C  1.891568 -1.568035 0.221858
C  3.271425 0.377084 -0.095773
C  2.77377 -2.052672 1.173484
C  4.15509 -0.095779 0.863719
C  3.905654 -1.301203 1.482015
C  1.968434 -4.256961 1.235687
C  0.956137 -4.906018 1.923282
C  2.365093 -4.689933 -0.022385
C  0.334006 -6.001168 1.341715
C  1.72751 -5.777941 -0.595822
C  0.710789 -6.436738 0.080782
H  -1.130015 4.376669 -0.251657
H  -2.058218 1.466976 0.186597
H  -2.693982 3.514384 3.14195
H  -3.294748 2.263819 2.054754
H  -1.990188 1.90126 3.179164
H  0.624416 3.990777 1.408096
H  -0.343846 4.459179 2.800951
H  0.393064 2.861374 2.739854
H  -3.830664 4.438923 0.710465
H  1.635315 0.971023 -2.015446
H  1.00964 -2.146086 -0.028695
H  3.461511 1.325099 -0.580174
H  5.042506 0.463589 1.127074
H  0.664663 -4.556029 2.904778
H  3.161745 -4.18412 -0.55276
H  -0.456178 -6.509729 1.877738
H  2.030812 -6.111501 -1.579096
H  0.216811 -7.284897 -0.373045
totalener: -2149.91307061 hartree
nucrepener: 2917.10627517 hartree
electener: -5067.01934578 hartree
oneelecener: -8747.69141537 hartree
twoeener: 3680.67206959 hartree
kineticenergy: 2143.53237800 hartree
xcener: -159.167821258302 hartree
chargesum: -0.0000000
charge: -0.027931 -0.038160 -0.182749 -0.258063 -0.388083 -0.289339 -0.001501 0.113144 -0.021113 -0.161635 -0.269374 -0.250676 -0.240761 0.386073 0.088699 0.330016 -0.017736 -0.266903 -0.152302 -0.112158 0.134857 -0.153688 0.197423 0.220272 -0.197908 -0.144836 -0.095821 -0.105836 -0.135215 0.109869 0.106572 0.093868 0.088933 0.096951 0.101846 0.086884 0.091223 0.118970 0.121800 0.132808 0.123462 0.127182 0.126540 0.132439 0.126445 0.128853 0.126658
qa: -0.0279 -0.0382 -0.1827 -0.2581 -0.3881 -0.2893 -0.0015 0.1131 -0.0211 -0.1616 -0.2694 -0.2507 -0.2408 0.3861 0.0887 0.3300 -0.0177 -0.2669 -0.1523 -0.1122 0.1349 -0.1537 0.1974 0.2203 -0.1979 -0.1448 -0.0958 -0.1058 -0.1352 0.1099 0.1066 0.0939 0.0889 0.0970 0.1018 0.0869 0.0912 0.1190 0.1218 0.1328 0.1235 0.1272 0.1265 0.1324 0.1264 0.1289 0.1267
va: 1.3051 1.2677 1.1205 2.1292 2.1130 2.1168 3.1154 3.7274 3.8499 3.8909 3.9164 3.9007 3.9022 4.1603 4.2096 3.8266 3.7117 4.0295 3.9526 3.9166 3.7954 3.9244 4.0908 3.8196 4.0360 3.9504 3.9369 3.9562 3.9610 1.0247 1.0251 1.0012 1.0005 1.0063 1.0208 1.0028 1.0015 1.0166 1.0216 1.0146 1.0180 1.0070 1.0121 1.0021 0.9989 1.0000 1.0002
dispcorr: -0.024465793 hartree
energy: -2149.937536401364
dipole: 8.92865 -9.09329 -0.16464 -7.44219 8.07295 0.63076 19.32411 -18.13577 1.18834
magnitude: 1.35540 au
magnitude: 3.44517 debye
