program: Orca
programVersion: 5.0.2
elementType: Cl Cl F O O O N C C C C C C C C C C C C C C C C C C C C C C H H H H H H H H H H H H H H H H H H
charge: 0
multiplicity: 1
keywords: wb97x-d3
keywords: def2-TZVPP
keywords: def2/J RIJCOSX
keywords: DEFGRID2
keywords: scfconv7
keywords: smallprint printgap noloewdin
keywords: NOSOSCF
formula: C22H18Cl2FNO3
InChI: InChI=1/C22H18Cl2FNO3/c1-22(2)15(11-19(23)24)20(22)21(27)29-18(12-26)13-8-9-16(25)17(10-13)28-14-6-4-3-5-7-14/h3-11,15,18,20H,1-2H3
47 atoms
Cl -4.689589 3.157286 1.12512
Cl -5.500368 3.861603 -1.55168
F  5.062098 -3.576698 -0.180276
O  1.237288 1.337916 -0.796241
O  0.145202 1.468113 1.161136
O  2.464443 -3.496752 0.246972
N  3.824123 3.347879 -1.284919
C  -2.054766 0.086843 -0.647003
C  -2.434312 1.494682 -0.290579
C  -1.071938 1.220324 -0.884587
C  -2.63071 -0.559539 -1.883847
C  -1.838642 -0.89268 0.480387
C  -3.413979 2.26279 -1.070297
C  0.124512 1.369171 -0.033713
C  -4.398732 2.992242 -0.559566
C  2.494982 1.410262 -0.142885
C  3.210029 0.075654 -0.205441
C  3.242597 2.487996 -0.793973
C  2.478423 -1.080809 0.051353
C  4.570309 -0.011183 -0.451741
C  3.100763 -2.318024 0.063358
C  5.200787 -1.24852 -0.441423
C  4.470027 -2.384628 -0.185087
C  1.290217 -3.565401 0.943957
C  1.131099 -2.963836 2.185642
C  0.271747 -4.326946 0.390726
C  -0.063699 -3.12782 2.868666
C  -0.912591 -4.494599 1.092404
C  -1.088449 -3.8913 2.328354
H  -2.42164 1.706255 0.772432
H  -0.917662 1.484421 -1.925002
H  -2.000859 -1.3921 -2.200292
H  -3.626705 -0.954401 -1.6782
H  -2.713787 0.122599 -2.729072
H  -1.48432 -0.424647 1.39549
H  -2.779157 -1.394403 0.712216
H  -1.123197 -1.667381 0.196511
H  -3.339975 2.243225 -2.150688
H  2.351911 1.694937 0.905339
H  1.415336 -1.033907 0.246533
H  5.155427 0.874388 -0.65987
H  6.261695 -1.330452 -0.634839
H  1.931945 -2.380788 2.622055
H  0.419234 -4.795015 -0.57368
H  -0.188362 -2.658991 3.835554
H  -1.703325 -5.095999 0.664015
H  -2.015456 -4.018194 2.870528
totalener: -2149.91287319 hartree
nucrepener: 2964.26694954 hartree
electener: -5114.17982273 hartree
oneelecener: -8841.20759984 hartree
twoeener: 3727.02777711 hartree
kineticenergy: 2143.51423025 hartree
xcener: -159.170042941541 hartree
chargesum: 0.0000000
charge: -0.038746 -0.042707 -0.183136 -0.261969 -0.358446 -0.282218 0.000001 0.109582 0.038630 -0.078702 -0.247968 -0.262886 -0.205901 0.299291 0.051736 0.352543 -0.076268 -0.261390 -0.128493 -0.150223 0.191276 -0.137900 0.182022 0.234766 -0.163903 -0.186106 -0.116365 -0.106026 -0.139477 0.088194 0.083472 0.096599 0.100354 0.075473 0.111982 0.099521 0.052975 0.098478 0.133026 0.119704 0.129461 0.127421 0.136505 0.128078 0.131560 0.127590 0.128588
qa: -0.0387 -0.0427 -0.1831 -0.2620 -0.3584 -0.2822 0.0000 0.1096 0.0386 -0.0787 -0.2480 -0.2629 -0.2059 0.2993 0.0517 0.3525 -0.0763 -0.2614 -0.1285 -0.1502 0.1913 -0.1379 0.1820 0.2348 -0.1639 -0.1861 -0.1164 -0.1060 -0.1395 0.0882 0.0835 0.0966 0.1004 0.0755 0.1120 0.0995 0.0530 0.0985 0.1330 0.1197 0.1295 0.1274 0.1365 0.1281 0.1316 0.1276 0.1286
va: 1.2885 1.2626 1.1198 2.1144 2.1449 2.1309 3.1117 3.7419 3.8459 3.8596 3.9089 3.9064 3.9230 4.2862 4.2497 3.7920 3.9479 4.0305 3.9162 3.9370 3.7228 3.9412 4.0838 3.8018 3.9365 3.9792 3.8993 3.9064 3.9022 1.0505 1.0368 1.0033 1.0027 1.0106 1.0143 1.0051 1.0080 1.0294 1.0217 0.9900 1.0210 1.0079 1.0005 1.0133 0.9998 0.9999 1.0007
dispcorr: -0.026840435 hartree
energy: -2149.939713622385
dipole: 3.21299 -4.02615 -0.81316 -23.56838 22.16889 -1.39949 2.03940 -1.89853 0.14087
magnitude: 1.62470 au
magnitude: 4.12965 debye
