program: Orca
programVersion: 5.0.2
elementType: Cl Cl F O O O N C C C C C C C C C C C C C C C C C C C C C C H H H H H H H H H H H H H H H H H H
charge: 0
multiplicity: 1
keywords: wb97x-d3
keywords: def2-TZVPP
keywords: def2/J RIJCOSX
keywords: DEFGRID2
keywords: scfconv7
keywords: smallprint printgap noloewdin
keywords: NOSOSCF
formula: C22H18Cl2FNO3
InChI: InChI=1/C22H18Cl2FNO3/c1-22(2)15(11-19(23)24)20(22)21(27)29-18(12-26)13-8-9-16(25)17(10-13)28-14-6-4-3-5-7-14/h3-11,15,18,20H,1-2H3
47 atoms
Cl -3.539296 3.602646 1.128337
Cl -4.941087 5.455838 -0.582688
F  4.314759 -2.224708 -1.772651
O  0.203248 1.604317 0.886616
O  -1.219421 0.115736 0.014398
O  2.205768 -3.529034 -0.75454
N  2.071693 1.69249 3.609136
C  -1.263099 2.244357 -2.304886
C  -2.525087 2.3008 -1.507991
C  -1.204484 2.370916 -0.788357
C  -0.827517 3.47343 -3.066758
C  -0.883092 0.952185 -2.98555
C  -3.412363 3.484196 -1.547136
C  -0.783396 1.233433 0.049105
C  -3.896083 4.097157 -0.475066
C  0.829786 0.554008 1.612321
C  1.791269 -0.208652 0.73413
C  1.523154 1.204223 2.726202
C  1.555963 -1.542453 0.440175
C  2.878972 0.446389 0.167299
C  2.41461 -2.237216 -0.400995
C  3.729022 -0.232795 -0.686036
C  3.494755 -1.566975 -0.95883
C  2.042751 -4.476737 0.218374
C  1.253143 -5.570657 -0.106306
C  2.659619 -4.393591 1.459541
C  1.08357 -6.58813 0.818454
C  2.473467 -5.417173 2.377291
C  1.687407 -6.515684 2.065587
H  -3.043773 1.351123 -1.398637
H  -0.892245 3.341615 -0.421412
H  -1.093763 4.399832 -2.557248
H  0.25425 3.471278 -3.206843
H  -1.286892 3.494301 -4.056925
H  -1.286917 0.941427 -3.999282
H  0.201478 0.857774 -3.062329
H  -1.259325 0.071612 -2.471164
H  -3.715456 3.864101 -2.515988
H  0.084194 -0.128417 2.032537
H  0.693452 -2.051222 0.852422
H  3.069993 1.488026 0.391011
H  4.582034 0.25936 -1.133141
H  0.782753 -5.619424 -1.079371
H  3.287512 -3.549303 1.713042
H  0.46797 -7.440171 0.562179
H  2.956778 -5.352823 3.343135
H  1.549035 -7.309684 2.786557
totalener: -2149.91187156 hartree
nucrepener: 2917.62484284 hartree
electener: -5067.53671440 hartree
oneelecener: -8748.46240878 hartree
twoeener: 3680.92569438 hartree
kineticenergy: 2143.53614799 hartree
xcener: -159.167978316607 hartree
chargesum: -0.0000000
charge: -0.029150 -0.038909 -0.181564 -0.254541 -0.375807 -0.292467 0.000782 0.108783 -0.000709 -0.164165 -0.267872 -0.248099 -0.254625 0.368935 0.094639 0.322435 -0.011833 -0.260377 -0.086170 -0.160371 0.116207 -0.160669 0.216712 0.236237 -0.206063 -0.143422 -0.089537 -0.127381 -0.144115 0.107650 0.108528 0.089602 0.096157 0.094139 0.088124 0.089594 0.102063 0.118978 0.118448 0.124609 0.126166 0.128818 0.127158 0.131032 0.126382 0.129286 0.126382
qa: -0.0291 -0.0389 -0.1816 -0.2545 -0.3758 -0.2925 0.0008 0.1088 -0.0007 -0.1642 -0.2679 -0.2481 -0.2546 0.3689 0.0946 0.3224 -0.0118 -0.2604 -0.0862 -0.1604 0.1162 -0.1607 0.2167 0.2362 -0.2061 -0.1434 -0.0895 -0.1274 -0.1441 0.1076 0.1085 0.0896 0.0962 0.0941 0.0881 0.0896 0.1021 0.1190 0.1184 0.1246 0.1262 0.1288 0.1272 0.1310 0.1264 0.1293 0.1264
va: 1.3023 1.2664 1.1224 2.1318 2.1279 2.1151 3.1190 3.7368 3.8305 3.8856 3.9118 3.9011 3.9112 4.1804 4.2064 3.8391 3.6509 4.0245 3.9087 3.9764 3.8147 3.9120 4.1060 3.8024 4.0280 3.9119 3.9435 3.9664 3.9620 1.0264 1.0239 1.0006 1.0063 1.0018 1.0037 1.0021 1.0192 1.0177 1.0191 1.0210 1.0155 1.0067 1.0132 1.0060 0.9985 1.0000 1.0002
dispcorr: -0.024820163 hartree
energy: -2149.936691724512
dipole: 12.11510 -12.42296 -0.30787 -19.64803 19.38991 -0.25812 -12.35775 11.06619 -1.29157
magnitude: 1.35261 au
magnitude: 3.43806 debye
