program: Orca
programVersion: 5.0.2
elementType: Cl Cl F O O O N C C C C C C C C C C C C C C C C C C C C C C H H H H H H H H H H H H H H H H H H
charge: 0
multiplicity: 1
keywords: wb97x-d3
keywords: def2-TZVPP
keywords: def2/J RIJCOSX
keywords: DEFGRID2
keywords: scfconv7
keywords: smallprint printgap noloewdin
keywords: NOSOSCF
formula: C22H18Cl2FNO3
InChI: InChI=1/C22H18Cl2FNO3/c1-22(2)15(11-19(23)24)20(22)21(27)29-18(12-26)13-8-9-16(25)17(10-13)28-14-6-4-3-5-7-14/h3-11,15,18,20H,1-2H3
47 atoms
Cl -1.739454 -0.363248 1.932007
Cl -4.508588 -0.973144 1.401755
F  4.248668 -3.205155 -0.798034
O  0.870901 1.985682 -0.109685
O  0.609646 3.287152 1.696316
O  1.726184 -2.914414 -0.006567
N  3.277838 3.759178 -1.589647
C  -1.988682 3.036211 -0.771244
C  -1.924135 1.58192 -0.436513
C  -1.31976 2.583703 0.517062
C  -3.29743 3.766731 -0.586467
C  -1.17031 3.56029 -1.926039
C  -3.122489 0.816129 -0.029007
C  0.129935 2.679963 0.783337
C  -3.123433 -0.056129 0.969102
C  2.275228 1.978471 0.044098
C  2.803111 0.585734 -0.235308
C  2.839469 2.974243 -0.874876
C  1.986325 -0.513421 -0.005337
C  4.115021 0.397456 -0.645812
C  2.464261 -1.799251 -0.213297
C  4.608048 -0.885993 -0.824304
C  3.784888 -1.970881 -0.613944
C  0.37835 -2.892319 -0.248574
C  -0.44263 -3.523972 0.67095
C  -0.155976 -2.306887 -1.389938
C  -1.811373 -3.561419 0.451204
C  -1.526628 -2.342678 -1.590567
C  -2.360415 -2.965866 -0.673096
H  -1.210195 0.99985 -1.014045
H  -1.889294 2.801442 1.413281
H  -3.923569 3.665597 -1.475199
H  -3.867053 3.395698 0.265979
H  -3.121123 4.83106 -0.426523
H  -0.868838 4.594188 -1.751692
H  -0.272212 2.977907 -2.116675
H  -1.768964 3.542362 -2.838209
H  -4.039214 0.93838 -0.593722
H  2.543048 2.281063 1.062536
H  0.964984 -0.383779 0.327029
H  4.763418 1.242236 -0.838293
H  5.628341 -1.047147 -1.144814
H  -0.008468 -3.978078 1.551757
H  0.488116 -1.831846 -2.11888
H  -2.452253 -4.048177 1.173927
H  -1.943154 -1.886568 -2.479077
H  -3.429278 -2.986415 -0.83384
totalener: -2149.90830665 hartree
nucrepener: 3162.53257756 hartree
electener: -5312.44088421 hartree
oneelecener: -9237.95690868 hartree
twoeener: 3925.51602447 hartree
kineticenergy: 2143.53616768 hartree
xcener: -159.175436724656 hartree
chargesum: -0.0000000
charge: -0.035280 -0.049671 -0.183727 -0.277607 -0.335562 -0.287855 0.000333 0.115653 0.007413 -0.135874 -0.277488 -0.248929 -0.298292 0.354749 0.159284 0.302367 0.015935 -0.261767 -0.138589 -0.166533 0.196505 -0.138959 0.178539 0.266314 -0.199613 -0.165399 -0.106931 -0.143823 -0.133530 0.096885 0.108074 0.092919 0.088577 0.100837 0.103934 0.087916 0.086821 0.118801 0.130347 0.069279 0.124439 0.127390 0.126298 0.135732 0.127536 0.129784 0.132771
qa: -0.0353 -0.0497 -0.1837 -0.2776 -0.3356 -0.2879 0.0003 0.1157 0.0074 -0.1359 -0.2775 -0.2489 -0.2983 0.3547 0.1593 0.3024 0.0159 -0.2618 -0.1386 -0.1665 0.1965 -0.1390 0.1785 0.2663 -0.1996 -0.1654 -0.1069 -0.1438 -0.1335 0.0969 0.1081 0.0929 0.0886 0.1008 0.1039 0.0879 0.0868 0.1188 0.1303 0.0693 0.1244 0.1274 0.1263 0.1357 0.1275 0.1298 0.1328
va: 1.3033 1.2578 1.1191 2.0749 2.1709 2.1282 3.1084 3.7493 3.7695 3.8696 3.9204 3.9017 3.9321 4.1940 4.1511 3.7857 3.8103 3.9985 3.9056 3.9713 3.7349 3.9260 4.1062 3.7646 3.9993 3.9019 3.9067 3.8987 3.8522 1.0189 1.0239 1.0010 1.0010 1.0056 1.0014 1.0165 1.0042 1.0188 1.0237 1.0593 1.0173 1.0074 1.0125 1.0007 1.0035 0.9999 1.0045
dispcorr: -0.031460745 hartree
energy: -2149.939767398006
dipole: -8.37499 6.99034 -1.38465 18.65330 -18.99927 -0.34597 -14.90156 14.58129 -0.32027
magnitude: 1.46271 au
magnitude: 3.71792 debye
