program: Orca
programVersion: 5.0.2
elementType: Cl Cl F O O O N C C C C C C C C C C C C C C C C C C C C C C H H H H H H H H H H H H H H H H H H
charge: 0
multiplicity: 1
keywords: wb97x-d3
keywords: def2-TZVPP
keywords: def2/J RIJCOSX
keywords: DEFGRID2
keywords: scfconv7
keywords: smallprint printgap noloewdin
keywords: NOSOSCF
formula: C22H18Cl2FNO3
InChI: InChI=1/C22H18Cl2FNO3/c1-22(2)15(11-19(23)24)20(22)21(27)29-18(12-26)13-8-9-16(25)17(10-13)28-14-6-4-3-5-7-14/h3-11,15,18,20H,1-2H3
47 atoms
Cl -5.223858 1.190002 0.391483
Cl -5.729632 3.879635 -0.51787
F  4.070257 -2.999379 -1.891245
O  1.24982 2.094173 0.216144
O  -0.117181 0.449455 0.87415
O  2.993675 -3.362317 0.515769
N  4.13795 3.342208 1.211421
C  -1.472676 1.244433 -1.865671
C  -2.320142 1.658313 -0.697316
C  -0.863626 2.054692 -0.735906
C  -1.615649 1.955786 -3.189616
C  -1.149469 -0.222603 -2.015009
C  -3.348059 2.702495 -0.805616
C  0.081964 1.427887 0.208378
C  -4.59693 2.596603 -0.368004
C  2.315187 1.489502 0.944802
C  2.857038 0.287348 0.211906
C  3.328702 2.536452 1.0904
C  2.679108 -0.980817 0.743525
C  3.470608 0.444253 -1.024771
C  3.094365 -2.100755 0.037987
C  3.894509 -0.666686 -1.732667
C  3.690321 -1.926257 -1.204684
C  1.820374 -3.819653 1.048161
C  1.928833 -4.881109 1.935963
C  0.575858 -3.30685 0.709083
C  0.783605 -5.433454 2.483628
C  -0.561062 -3.86517 1.274981
C  -0.467288 -4.927199 2.159833
H  -2.546918 0.857622 -0.002529
H  -0.635502 3.085678 -0.983058
H  -1.765183 3.029729 -3.086518
H  -0.71921 1.809598 -3.793681
H  -2.463266 1.556365 -3.748267
H  -0.176409 -0.361406 -2.490105
H  -1.140866 -0.753218 -1.066003
H  -1.898144 -0.697701 -2.650313
H  -3.079136 3.642477 -1.271637
H  1.983475 1.200771 1.947332
H  2.192991 -1.106469 1.702585
H  3.62464 1.431718 -1.440591
H  4.375126 -0.564514 -2.696036
H  2.907465 -5.269564 2.184896
H  0.479957 -2.480703 0.017372
H  0.872339 -6.262853 3.172486
H  -1.52962 -3.460025 1.014308
H  -1.359871 -5.3571 2.59288
totalener: -2149.91288342 hartree
nucrepener: 2948.12421438 hartree
electener: -5098.03709779 hartree
oneelecener: -8809.06170746 hartree
twoeener: 3711.02460967 hartree
kineticenergy: 2143.53938592 hartree
xcener: -159.170308359658 hartree
chargesum: -0.0000000
charge: -0.038837 -0.041228 -0.180728 -0.251571 -0.374594 -0.290134 0.001661 0.077038 0.042913 -0.086936 -0.240040 -0.242059 -0.208535 0.335486 0.051815 0.317203 0.002202 -0.260072 -0.141075 -0.168728 0.170006 -0.153083 0.201837 0.257301 -0.211687 -0.140312 -0.092304 -0.125831 -0.137709 0.088873 0.083167 0.073433 0.094865 0.100894 0.092873 0.076175 0.097651 0.099285 0.119275 0.131308 0.125497 0.129350 0.127159 0.114064 0.125920 0.123222 0.124989
qa: -0.0388 -0.0412 -0.1807 -0.2516 -0.3746 -0.2901 0.0017 0.0770 0.0429 -0.0869 -0.2400 -0.2421 -0.2085 0.3355 0.0518 0.3172 0.0022 -0.2601 -0.1411 -0.1687 0.1700 -0.1531 0.2018 0.2573 -0.2117 -0.1403 -0.0923 -0.1258 -0.1377 0.0889 0.0832 0.0734 0.0949 0.1009 0.0929 0.0762 0.0977 0.0993 0.1193 0.1313 0.1255 0.1294 0.1272 0.1141 0.1259 0.1232 0.1250
va: 1.2886 1.2644 1.1237 2.1392 2.1247 2.1284 3.1167 3.7557 3.8259 3.8619 3.9072 3.9176 3.9185 4.2629 4.2492 3.8430 3.6286 4.0218 3.9377 3.9792 3.7895 3.9048 4.1118 3.8258 4.0188 3.9201 3.9461 3.9720 3.9654 1.0468 1.0354 1.0097 1.0040 1.0030 1.0011 1.0200 1.0053 1.0286 1.0161 1.0156 1.0154 1.0063 1.0140 1.0038 0.9988 1.0010 1.0003
dispcorr: -0.025566756 hartree
energy: -2149.938450174362
dipole: 10.75068 -11.50481 -0.75412 -12.55900 12.18356 -0.37543 -7.43937 6.63735 -0.80202
magnitude: 1.16314 au
magnitude: 2.95646 debye
