program: Orca
programVersion: 5.0.2
elementType: Cl Cl F O O O N C C C C C C C C C C C C C C C C C C C C C C H H H H H H H H H H H H H H H H H H
charge: 0
multiplicity: 1
keywords: wb97x-d3
keywords: def2-TZVPP
keywords: def2/J RIJCOSX
keywords: DEFGRID2
keywords: scfconv7
keywords: smallprint printgap noloewdin
keywords: NOSOSCF
formula: C22H18Cl2FNO3
InChI: InChI=1/C22H18Cl2FNO3/c1-22(2)15(11-19(23)24)20(22)21(27)29-18(12-26)13-8-9-16(25)17(10-13)28-14-6-4-3-5-7-14/h3-11,15,18,20H,1-2H3
47 atoms
Cl -3.767826 3.449615 1.043856
Cl -5.006679 5.434578 -0.64666
F  4.255863 -2.21011 -1.845184
O  0.140026 1.558208 0.9124
O  -1.273406 0.108486 -0.038481
O  2.217317 -3.576647 -0.766217
N  2.021079 1.544607 3.626911
C  -1.190405 2.333149 -2.280765
C  -2.499871 2.349387 -1.562449
C  -1.227629 2.393049 -0.759329
C  -0.712615 3.594501 -2.959739
C  -0.763178 1.071204 -2.989928
C  -3.38624 3.533583 -1.605513
C  -0.83468 1.222035 0.045483
C  -3.97425 4.066597 -0.543162
C  0.760677 0.481013 1.600388
C  1.720259 -0.256597 0.698304
C  1.459727 1.089598 2.734356
C  1.522607 -1.599519 0.420404
C  2.774112 0.428608 0.104175
C  2.38692 -2.274385 -0.431339
C  3.626964 -0.230021 -0.762495
C  3.431688 -1.573577 -1.018794
C  2.067536 -4.511812 0.221274
C  2.692867 -4.404476 1.456446
C  1.28543 -5.617231 -0.081114
C  2.521534 -5.414703 2.391531
C  1.131051 -6.621698 0.860685
C  1.742458 -6.524415 2.102287
H  -3.019016 1.394548 -1.526233
H  -0.945464 3.348588 -0.332469
H  -1.008645 4.497306 -2.424927
H  0.375648 3.596799 -3.035053
H  -1.111913 3.661805 -3.973685
H  0.324391 0.979726 -3.001664
H  -1.169184 0.169574 -2.538057
H  -1.102311 1.10304 -4.026707
H  -3.594059 3.98514 -2.56862
H  0.012572 -0.212144 1.998288
H  0.686239 -2.132423 0.855637
H  2.936221 1.477526 0.316052
H  4.453817 0.285556 -1.231847
H  3.315382 -3.550987 1.692051
H  0.808874 -5.685186 -1.050028
H  3.010742 -5.331056 3.352909
H  0.5212 -7.482979 0.622159
H  1.615357 -7.307978 2.836656
totalener: -2149.91165773 hartree
nucrepener: 2916.14019423 hartree
electener: -5066.05185196 hartree
oneelecener: -8745.47580449 hartree
twoeener: 3679.42395253 hartree
kineticenergy: 2143.53507222 hartree
xcener: -159.167534322554 hartree
chargesum: 0.0000000
charge: -0.029671 -0.038507 -0.181629 -0.255354 -0.369595 -0.292079 0.000815 0.112044 -0.004350 -0.161571 -0.269291 -0.247161 -0.249999 0.357885 0.090981 0.322757 -0.000987 -0.259666 -0.090374 -0.170544 0.120700 -0.158840 0.215364 0.233559 -0.143738 -0.205670 -0.126036 -0.089717 -0.143558 0.108948 0.108447 0.089736 0.095476 0.094625 0.088747 0.101301 0.089054 0.119219 0.117534 0.123492 0.126809 0.128782 0.131856 0.127447 0.129538 0.126664 0.126556
qa: -0.0297 -0.0385 -0.1816 -0.2554 -0.3696 -0.2921 0.0008 0.1120 -0.0044 -0.1616 -0.2693 -0.2472 -0.2500 0.3579 0.0910 0.3228 -0.0010 -0.2597 -0.0904 -0.1705 0.1207 -0.1588 0.2154 0.2336 -0.1437 -0.2057 -0.1260 -0.0897 -0.1436 0.1089 0.1084 0.0897 0.0955 0.0946 0.0887 0.1013 0.0891 0.1192 0.1175 0.1235 0.1268 0.1288 0.1319 0.1274 0.1295 0.1267 0.1266
va: 1.3017 1.2672 1.1224 2.1285 2.1352 2.1152 3.1188 3.7379 3.8378 3.8735 3.9118 3.9004 3.9084 4.1977 4.2089 3.8391 3.6463 4.0251 3.9154 3.9735 3.8109 3.9078 4.1051 3.8040 3.9136 4.0286 3.9646 3.9425 3.9617 1.0255 1.0240 1.0006 1.0064 1.0015 1.0023 1.0190 1.0039 1.0169 1.0196 1.0193 1.0163 1.0066 1.0053 1.0130 0.9999 0.9985 1.0001
dispcorr: -0.024935942 hartree
energy: -2149.936593675359
dipole: 13.71112 -13.96551 -0.25439 -18.46559 18.27184 -0.19375 -11.63426 10.36364 -1.27062
magnitude: 1.31024 au
magnitude: 3.33037 debye
