program: Orca
programVersion: 5.0.2
elementType: Cl Cl F O O O N C C C C C C C C C C C C C C C C C C C C C C H H H H H H H H H H H H H H H H H H
charge: 0
multiplicity: 1
keywords: wb97x-d3
keywords: def2-TZVPP
keywords: def2/J RIJCOSX
keywords: DEFGRID2
keywords: scfconv7
keywords: smallprint printgap noloewdin
keywords: NOSOSCF
formula: C22H18Cl2FNO3
InChI: InChI=1/C22H18Cl2FNO3/c1-22(2)15(11-19(23)24)20(22)21(27)29-18(12-26)13-8-9-16(25)17(10-13)28-14-6-4-3-5-7-14/h3-11,15,18,20H,1-2H3
47 atoms
Cl -3.724958 3.328211 1.115568
Cl -4.976619 5.449649 -0.390119
F  4.307023 -2.259003 -1.963357
O  0.107264 1.444629 0.820291
O  -1.293342 0.067614 -0.251167
O  2.476781 -3.734981 -0.691162
N  1.943106 1.210188 3.572409
C  -1.222921 2.446481 -2.329744
C  -2.521268 2.422576 -1.591473
C  -1.236187 2.397957 -0.807395
C  -0.745253 3.750236 -2.924134
C  -0.817349 1.235391 -3.133968
C  -3.396681 3.614032 -1.527811
C  -0.85399 1.171149 -0.084631
C  -3.954574 4.069814 -0.414186
C  0.701599 0.322521 1.451174
C  1.675213 -0.373521 0.530635
C  1.390367 0.84365 2.634568
C  1.603627 -1.746162 0.361317
C  2.633345 0.365704 -0.151594
C  2.504766 -2.399759 -0.468855
C  3.515452 -0.273426 -1.00478
C  3.450147 -1.644711 -1.152213
C  2.223461 -4.578122 0.358399
C  2.811885 -4.398132 1.60369
C  1.385797 -5.656266 0.120345
C  2.544347 -5.305914 2.616277
C  1.135684 -6.562096 1.140219
C  1.707291 -6.389235 2.391677
H  -3.047735 1.471146 -1.615095
H  -0.940097 3.318814 -0.31811
H  0.341282 3.749363 -3.02135
H  -1.163737 3.894808 -3.922362
H  -1.022188 4.614093 -2.319301
H  -1.212951 0.305385 -2.732746
H  -1.182734 1.337006 -4.157515
H  0.269524 1.144826 -3.179421
H  -3.620021 4.13912 -2.449247
H  -0.061424 -0.386169 1.789711
H  0.840606 -2.319434 0.873537
H  2.698855 1.437816 -0.021058
H  4.269652 0.281763 -1.546016
H  3.47625 -3.562906 1.78524
H  0.939972 -5.781735 -0.857338
H  3.002074 -5.165437 3.586394
H  0.482486 -7.404132 0.953758
H  1.504393 -7.094367 3.186093
totalener: -2149.91142579 hartree
nucrepener: 2912.87801412 hartree
electener: -5062.78943992 hartree
oneelecener: -8738.97853847 hartree
twoeener: 3676.18909855 hartree
kineticenergy: 2143.53364219 hartree
xcener: -159.167572807826 hartree
chargesum: -0.0000000
charge: -0.029263 -0.038583 -0.182902 -0.261292 -0.364343 -0.289854 0.000578 0.110564 -0.004207 -0.159267 -0.269253 -0.246604 -0.250029 0.345293 0.092027 0.316652 0.024052 -0.254356 -0.106844 -0.189093 0.134744 -0.151936 0.208255 0.222826 -0.146961 -0.200849 -0.120849 -0.092835 -0.138858 0.109283 0.109178 0.094848 0.095156 0.089966 0.103002 0.089351 0.086995 0.119155 0.118502 0.120646 0.128218 0.127879 0.135856 0.128838 0.131103 0.127459 0.127753
qa: -0.0293 -0.0386 -0.1829 -0.2613 -0.3643 -0.2899 0.0006 0.1106 -0.0042 -0.1593 -0.2693 -0.2466 -0.2500 0.3453 0.0920 0.3167 0.0241 -0.2544 -0.1068 -0.1891 0.1347 -0.1519 0.2083 0.2228 -0.1470 -0.2008 -0.1208 -0.0928 -0.1389 0.1093 0.1092 0.0948 0.0952 0.0900 0.1030 0.0894 0.0870 0.1192 0.1185 0.1206 0.1282 0.1279 0.1359 0.1288 0.1311 0.1275 0.1278
va: 1.3023 1.2669 1.1205 2.1176 2.1403 2.1169 3.1201 3.7397 3.8382 3.8661 3.9120 3.8993 3.9100 4.2074 4.2065 3.8374 3.6627 4.0222 3.9265 3.9695 3.8000 3.9050 4.0970 3.8155 3.9319 4.0330 3.9553 3.9364 3.9592 1.0257 1.0237 1.0066 1.0015 1.0006 1.0189 1.0036 1.0032 1.0170 1.0222 1.0153 1.0176 1.0065 1.0020 1.0122 0.9995 0.9986 0.9999
dispcorr: -0.024871342 hartree
energy: -2149.936297134756
dipole: 12.90543 -13.25323 -0.34780 -16.68735 16.57779 -0.10956 -12.04835 10.79459 -1.25376
magnitude: 1.30571 au
magnitude: 3.31886 debye
