program: Orca
programVersion: 5.0.2
elementType: Cl Cl F O O O N C C C C C C C C C C C C C C C C C C C C C C H H H H H H H H H H H H H H H H H H
charge: 0
multiplicity: 1
keywords: wb97x-d3
keywords: def2-TZVPP
keywords: def2/J RIJCOSX
keywords: DEFGRID2
keywords: scfconv7
keywords: smallprint printgap noloewdin
keywords: NOSOSCF
formula: C22H18Cl2FNO3
InChI: InChI=1/C22H18Cl2FNO3/c1-22(2)15(11-19(23)24)20(22)21(27)29-18(12-26)13-8-9-16(25)17(10-13)28-14-6-4-3-5-7-14/h3-11,15,18,20H,1-2H3
47 atoms
Cl -4.250273 3.068065 0.524315
Cl -5.044033 5.578423 -0.661176
F  4.62093 -1.885659 -0.975799
O  -0.401502 1.235599 1.072922
O  -1.274315 0.258137 -0.739579
O  2.43686 -3.46779 -0.964048
N  0.389003 0.20646 4.12139
C  -0.66668 3.108975 -1.953621
C  -2.130646 2.930472 -1.724509
C  -1.175127 2.647544 -0.594448
C  -0.096021 4.506839 -1.98104
C  0.04878 2.150637 -2.873703
C  -3.048548 4.087975 -1.639501
C  -0.98318 1.257362 -0.143104
C  -3.987976 4.225678 -0.713588
C  -0.021594 -0.044346 1.553195
C  1.228692 -0.544343 0.870795
C  0.201378 0.117455 2.991943
C  1.245311 -1.795702 0.278648
C  2.360945 0.261236 0.824008
C  2.395076 -2.262915 -0.342657
C  3.504285 -0.186996 0.188991
C  3.516806 -1.446853 -0.379695
C  2.270316 -4.608514 -0.228383
C  2.48283 -4.668332 1.14218
C  1.898668 -5.744789 -0.934958
C  2.314447 -5.878402 1.801027
C  1.74082 -6.94489 -0.263088
C  1.943756 -7.019334 1.107941
H  -2.563198 2.040016 -2.174813
H  -1.111884 3.389078 0.193739
H  -0.608844 5.183621 -1.296994
H  0.95863 4.493009 -1.703008
H  -0.16523 4.931676 -2.98448
H  -0.4053 1.163218 -2.897768
H  0.037498 2.544973 -3.891263
H  1.092786 2.032702 -2.578162
H  -2.973438 4.86298 -2.393232
H  -0.832618 -0.767769 1.419414
H  0.360588 -2.420705 0.285338
H  2.357131 1.240357 1.284799
H  4.394903 0.424936 0.144071
H  2.783699 -3.791294 1.700085
H  1.739854 -5.680249 -2.003219
H  2.48259 -5.922972 2.868863
H  1.451908 -7.828142 -0.817319
H  1.815995 -7.958023 1.629479
totalener: -2149.91155425 hartree
nucrepener: 2902.07669803 hartree
electener: -5051.98825228 hartree
oneelecener: -8717.31781826 hartree
twoeener: 3665.32956597 hartree
kineticenergy: 2143.53734825 hartree
xcener: -159.167802538181 hartree
chargesum: -0.0000000
charge: -0.029684 -0.038165 -0.181481 -0.261080 -0.366452 -0.293265 0.001671 0.110071 -0.007517 -0.157598 -0.269679 -0.245013 -0.247497 0.353226 0.091011 0.319746 0.014565 -0.255320 -0.101498 -0.169690 0.112440 -0.163974 0.231082 0.252593 -0.149399 -0.208000 -0.134110 -0.089646 -0.145192 0.109481 0.107236 0.089854 0.095249 0.094789 0.102712 0.088949 0.087299 0.119045 0.118625 0.119990 0.129250 0.128887 0.129247 0.126275 0.129262 0.125904 0.125802
qa: -0.0297 -0.0382 -0.1815 -0.2611 -0.3665 -0.2933 0.0017 0.1101 -0.0075 -0.1576 -0.2697 -0.2450 -0.2475 0.3532 0.0910 0.3197 0.0146 -0.2553 -0.1015 -0.1697 0.1124 -0.1640 0.2311 0.2526 -0.1494 -0.2080 -0.1341 -0.0896 -0.1452 0.1095 0.1072 0.0899 0.0952 0.0948 0.1027 0.0889 0.0873 0.1190 0.1186 0.1200 0.1292 0.1289 0.1292 0.1263 0.1293 0.1259 0.1258
va: 1.3023 1.2677 1.1231 2.1226 2.1389 2.1154 3.1191 3.7396 3.8419 3.8714 3.9127 3.9002 3.9084 4.1955 4.2083 3.8360 3.6411 4.0232 3.9668 3.9639 3.8192 3.9106 4.1029 3.7879 3.9040 4.0250 3.9761 3.9467 3.9633 1.0256 1.0243 1.0005 1.0063 1.0015 1.0192 1.0035 1.0030 1.0167 1.0209 1.0170 1.0166 1.0065 1.0091 1.0137 1.0001 0.9985 1.0003
dispcorr: -0.024727110 hartree
energy: -2149.936281364104
dipole: 19.35122 -19.11224 0.23898 -13.34213 13.76441 0.42228 -10.52097 9.27768 -1.24329
magnitude: 1.33461 au
magnitude: 3.39232 debye
