program: Orca
programVersion: 5.0.2
elementType: Cl Cl F O O O N C C C C C C C C C C C C C C C C C C C C C C H H H H H H H H H H H H H H H H H H
charge: 0
multiplicity: 1
keywords: wb97x-d3
keywords: def2-TZVPP
keywords: def2/J RIJCOSX
keywords: DEFGRID2
keywords: scfconv7
keywords: smallprint printgap noloewdin
keywords: NOSOSCF
formula: C22H18Cl2FNO3
InChI: InChI=1/C22H18Cl2FNO3/c1-22(2)15(11-19(23)24)20(22)21(27)29-18(12-26)13-8-9-16(25)17(10-13)28-14-6-4-3-5-7-14/h3-11,15,18,20H,1-2H3
47 atoms
Cl -3.189811 1.533317 -2.11874
Cl -5.867719 2.07407 -1.183753
F  5.040058 -2.518029 2.233982
O  0.516916 0.989913 -0.180041
O  0.523425 3.1426 -0.806943
O  2.662677 -3.43575 1.562418
N  1.170811 -0.425767 -3.142952
C  -1.610115 3.344229 1.50928
C  -2.255844 3.398484 0.165743
C  -1.299565 2.272771 0.474596
C  -2.42794 2.872289 2.688017
C  -0.583956 4.389442 1.870082
C  -3.696645 3.119015 -0.020986
C  -0.011138 2.228921 -0.242662
C  -4.183774 2.343519 -0.980632
C  1.73278 0.749345 -0.873368
C  2.623348 -0.125555 -0.032113
C  1.408848 0.097944 -2.148507
C  2.183157 -1.386674 0.359549
C  3.873713 0.32641 0.350099
C  2.999998 -2.205624 1.119837
C  4.695718 -0.483396 1.12327
C  4.258199 -1.732113 1.497126
C  1.645041 -4.124672 0.952727
C  0.605223 -4.574858 1.748602
C  1.678291 -4.408852 -0.405777
C  -0.415226 -5.319969 1.175722
C  0.646379 -5.143708 -0.967495
C  -0.40248 -5.600223 -0.181811
H  -1.851381 4.147801 -0.510791
H  -1.734356 1.300898 0.676508
H  -1.780221 2.457098 3.461266
H  -2.97946 3.703804 3.131243
H  -3.150277 2.102904 2.414407
H  0.139968 3.992739 2.583889
H  -0.036814 4.763897 1.008466
H  -1.078501 5.239421 2.343256
H  -4.40615 3.601923 0.640926
H  2.240167 1.691289 -1.099878
H  1.201884 -1.734886 0.061563
H  4.219495 1.306821 0.049605
H  5.677531 -0.150013 1.430643
H  0.603308 -4.347977 2.806447
H  2.498221 -4.059812 -1.020518
H  -1.226614 -5.676449 1.79613
H  0.665992 -5.361107 -2.026893
H  -1.203295 -6.175172 -0.626361
totalener: -2149.91216334 hartree
nucrepener: 2925.39686847 hartree
electener: -5075.30903181 hartree
oneelecener: -8764.29937613 hartree
twoeener: 3688.99034432 hartree
kineticenergy: 2143.53068921 hartree
xcener: -159.166920258394 hartree
chargesum: -0.0000000
charge: -0.023141 -0.040575 -0.183170 -0.268151 -0.374746 -0.283988 -0.001461 0.115455 -0.013592 -0.170035 -0.268636 -0.253479 -0.249169 0.376195 0.092713 0.336889 0.008300 -0.271008 -0.191350 -0.132241 0.182317 -0.138404 0.180879 0.238240 -0.191320 -0.177325 -0.099812 -0.104518 -0.134630 0.109818 0.106697 0.096438 0.094191 0.088346 0.089922 0.102289 0.087259 0.118422 0.115130 0.134031 0.117056 0.125360 0.127213 0.138200 0.127931 0.132702 0.128757
qa: -0.0231 -0.0406 -0.1832 -0.2682 -0.3747 -0.2840 -0.0015 0.1155 -0.0136 -0.1700 -0.2686 -0.2535 -0.2492 0.3762 0.0927 0.3369 0.0083 -0.2710 -0.1914 -0.1322 0.1823 -0.1384 0.1809 0.2382 -0.1913 -0.1773 -0.0998 -0.1045 -0.1346 0.1098 0.1067 0.0964 0.0942 0.0883 0.0899 0.1023 0.0873 0.1184 0.1151 0.1340 0.1171 0.1254 0.1272 0.1382 0.1279 0.1327 0.1288
va: 1.3107 1.2649 1.1194 2.1450 2.1307 2.1236 3.1185 3.7223 3.8403 3.8852 3.9162 3.9044 3.9068 4.1869 4.2096 3.7870 3.8174 4.0322 3.9626 3.9200 3.7724 3.9270 4.0964 3.7941 4.0427 3.9770 3.9342 3.9462 3.9571 1.0262 1.0222 1.0062 1.0014 1.0005 1.0014 1.0190 1.0031 1.0174 1.0427 1.0201 1.0086 1.0080 1.0119 1.0013 0.9989 0.9989 0.9998
dispcorr: -0.023933732 hartree
energy: -2149.936097073748
dipole: 5.92116 -6.23650 -0.31534 4.72776 -4.21005 0.51771 17.86086 -16.26968 1.59118
magnitude: 1.70274 au
magnitude: 4.32802 debye
