program: Orca
programVersion: 5.0.2
elementType: Cl Cl F O O O N C C C C C C C C C C C C C C C C C C C C C C H H H H H H H H H H H H H H H H H H
charge: 0
multiplicity: 1
keywords: wb97x-d3
keywords: def2-TZVPP
keywords: def2/J RIJCOSX
keywords: DEFGRID2
keywords: scfconv7
keywords: smallprint printgap noloewdin
keywords: NOSOSCF
formula: C22H18Cl2FNO3
InChI: InChI=1/C22H18Cl2FNO3/c1-22(2)15(11-19(23)24)20(22)21(27)29-18(12-26)13-8-9-16(25)17(10-13)28-14-6-4-3-5-7-14/h3-11,15,18,20H,1-2H3
47 atoms
Cl -5.236837 1.406887 0.425454
Cl -5.650171 4.174095 -0.280303
F  4.494153 -2.798081 -1.754885
O  1.185527 2.076929 0.307976
O  -0.212736 0.375673 0.701445
O  3.144242 -3.357945 0.448657
N  3.920155 3.264198 1.73585
C  -1.519591 1.502362 -1.945345
C  -2.353404 1.827078 -0.740752
C  -0.879375 2.167289 -0.740935
C  -1.637108 2.353775 -3.187121
C  -1.25295 0.048653 -2.250482
C  -3.337046 2.917919 -0.736148
C  0.021495 1.421703 0.160617
C  -4.573196 2.835096 -0.259661
C  2.180866 1.424718 1.091101
C  2.836352 0.296431 0.33458
C  3.148374 2.466516 1.441331
C  2.669824 -1.007591 0.776757
C  3.56836 0.555858 -0.816832
C  3.222934 -2.064035 0.06812
C  4.135797 -0.49129 -1.522921
C  3.955166 -1.786114 -1.080824
C  2.000564 -3.877071 0.988326
C  2.17041 -4.945901 1.857038
C  0.728632 -3.423767 0.664457
C  1.059467 -5.56544 2.404139
C  -0.373299 -4.048447 1.230181
C  -0.2176 -5.118261 2.09757
H  -2.610712 0.969775 -0.129309
H  -0.610762 3.208648 -0.880233
H  -0.749263 2.238205 -3.810126
H  -2.501534 2.048215 -3.778488
H  -1.745444 3.415981 -2.971418
H  -0.294427 -0.070305 -2.759009
H  -1.243861 -0.578701 -1.362662
H  -2.029279 -0.331706 -2.915935
H  -3.042264 3.877238 -1.143194
H  1.747136 1.04386 2.021387
H  2.090393 -1.206648 1.669127
H  3.708938 1.571562 -1.163556
H  4.715657 -0.311356 -2.417996
H  3.17005 -5.287366 2.091254
H  0.584691 -2.592969 -0.013873
H  1.196204 -6.400038 3.078786
H  -1.363605 -3.690409 0.982502
H  -1.083538 -5.599608 2.530741
totalener: -2149.91358419 hartree
nucrepener: 2922.44313511 hartree
electener: -5072.35671930 hartree
oneelecener: -8757.77137108 hartree
twoeener: 3685.41465177 hartree
kineticenergy: 2143.53145160 hartree
xcener: -159.169317799953 hartree
chargesum: -0.0000000
charge: -0.038793 -0.041801 -0.181399 -0.254239 -0.380690 -0.286809 0.001948 0.069367 0.045838 -0.091921 -0.241269 -0.243676 -0.207364 0.348808 0.052081 0.314583 -0.000189 -0.258060 -0.151442 -0.172456 0.188137 -0.145949 0.191199 0.282426 -0.223485 -0.181935 -0.084042 -0.114032 -0.145909 0.087771 0.084093 0.094657 0.100995 0.073819 0.092011 0.085465 0.095102 0.098885 0.117836 0.131005 0.125708 0.128519 0.127005 0.130267 0.126588 0.125796 0.125551
qa: -0.0388 -0.0418 -0.1814 -0.2542 -0.3807 -0.2868 0.0019 0.0694 0.0458 -0.0919 -0.2413 -0.2437 -0.2074 0.3488 0.0521 0.3146 -0.0002 -0.2581 -0.1514 -0.1725 0.1881 -0.1459 0.1912 0.2824 -0.2235 -0.1819 -0.0840 -0.1140 -0.1459 0.0878 0.0841 0.0947 0.1010 0.0738 0.0920 0.0855 0.0951 0.0989 0.1178 0.1310 0.1257 0.1285 0.1270 0.1303 0.1266 0.1258 0.1256
va: 1.2884 1.2635 1.1224 2.1406 2.1220 2.1322 3.1178 3.7596 3.8214 3.8689 3.9081 3.9180 3.9202 4.2468 4.2511 3.8465 3.6468 4.0165 3.9281 3.9869 3.7848 3.9025 4.1090 3.7884 4.0353 3.9426 3.9326 3.9591 3.9707 1.0492 1.0350 1.0043 1.0027 1.0097 1.0014 1.0195 1.0039 1.0292 1.0181 1.0144 1.0149 1.0065 1.0144 0.9988 0.9986 1.0001 1.0004
dispcorr: -0.024586181 hartree
energy: -2149.938170375845
dipole: 10.26017 -11.01828 -0.75811 -12.66347 12.29438 -0.36910 -9.02734 8.11018 -0.91717
magnitude: 1.24585 au
magnitude: 3.16671 debye
