program: Orca
programVersion: 5.0.2
elementType: Cl Cl F O O O N C C C C C C C C C C C C C C C C C C C C C C H H H H H H H H H H H H H H H H H H
charge: 0
multiplicity: 1
keywords: wb97x-d3
keywords: def2-TZVPP
keywords: def2/J RIJCOSX
keywords: DEFGRID2
keywords: scfconv7
keywords: smallprint printgap noloewdin
keywords: NOSOSCF
formula: C22H18Cl2FNO3
InChI: InChI=1/C22H18Cl2FNO3/c1-22(2)15(11-19(23)24)20(22)21(27)29-18(12-26)13-8-9-16(25)17(10-13)28-14-6-4-3-5-7-14/h3-11,15,18,20H,1-2H3
47 atoms
Cl -2.272923 3.424363 -2.368716
Cl -5.109242 3.763967 -1.961306
F  4.95757 -2.135644 2.170695
O  0.484114 0.817222 -1.076088
O  0.825548 2.476968 0.38452
O  2.820408 -3.281164 1.088413
N  2.051189 -0.196332 -3.805267
C  -1.960178 1.537727 1.521349
C  -2.141788 2.718919 0.628888
C  -1.360999 1.528489 0.124291
C  -3.122141 0.593345 1.720603
C  -1.081973 1.673795 2.74041
C  -3.444545 3.047835 0.009402
C  0.082651 1.688428 -0.131802
C  -3.589092 3.36781 -1.269943
C  1.862715 0.839849 -1.413284
C  2.694504 0.054686 -0.430882
C  1.950378 0.25768 -2.755135
C  2.33898 -1.255957 -0.135291
C  3.802371 0.629151 0.167696
C  3.089609 -1.99583 0.762155
C  4.578835 -0.115549 1.043402
C  4.219112 -1.413098 1.332662
C  1.519778 -3.698399 1.176374
C  1.211099 -4.931832 0.62527
C  0.548665 -2.952696 1.833327
C  -0.080984 -5.423227 0.733335
C  -0.741123 -3.452325 1.924387
C  -1.063254 -4.685479 1.376224
H  -1.525658 3.580626 0.874895
H  -1.869292 0.885492 -0.584633
H  -3.739038 0.493398 0.82722
H  -2.763255 -0.402664 1.98527
H  -3.765194 0.938041 2.532706
H  -0.639039 0.712589 3.008094
H  -0.273669 2.387652 2.605592
H  -1.683043 2.005491 3.588708
H  -4.331239 3.055742 0.632486
H  2.231909 1.869203 -1.467054
H  1.473508 -1.707459 -0.605701
H  4.0664 1.656899 -0.042124
H  5.452277 0.311941 1.516586
H  1.981821 -5.499046 0.120725
H  0.794069 -1.994686 2.274057
H  -0.319851 -6.386705 0.303273
H  -1.49813 -2.873364 2.437484
H  -2.071313 -5.069336 1.452557
totalener: -2149.91125227 hartree
nucrepener: 2989.02222601 hartree
electener: -5138.93347828 hartree
oneelecener: -8891.06188079 hartree
twoeener: 3752.12840251 hartree
kineticenergy: 2143.53938724 hartree
xcener: -159.168870929284 hartree
chargesum: -0.0000000
charge: -0.028233 -0.037214 -0.182680 -0.263719 -0.372138 -0.288497 0.002282 0.110461 -0.019450 -0.152898 -0.260960 -0.243371 -0.249480 0.354049 0.095175 0.321893 0.017788 -0.257390 -0.169441 -0.121489 0.151020 -0.145131 0.187979 0.236104 -0.198846 -0.165509 -0.088881 -0.109405 -0.146966 0.110219 0.110165 0.090125 0.084133 0.095359 0.079760 0.104803 0.089297 0.119719 0.121089 0.136982 0.112515 0.125991 0.129967 0.132737 0.128726 0.126428 0.126933
qa: -0.0282 -0.0372 -0.1827 -0.2637 -0.3721 -0.2885 0.0023 0.1105 -0.0194 -0.1529 -0.2610 -0.2434 -0.2495 0.3540 0.0952 0.3219 0.0178 -0.2574 -0.1694 -0.1215 0.1510 -0.1451 0.1880 0.2361 -0.1988 -0.1655 -0.0889 -0.1094 -0.1470 0.1102 0.1102 0.0901 0.0841 0.0954 0.0798 0.1048 0.0893 0.1197 0.1211 0.1370 0.1125 0.1260 0.1300 0.1327 0.1287 0.1264 0.1269
va: 1.3065 1.2690 1.1205 2.1185 2.1316 2.1220 3.1196 3.7293 3.8525 3.8774 3.9193 3.9007 3.9136 4.1811 4.2023 3.8431 3.6884 4.0251 3.9304 3.9639 3.7829 3.9182 4.1018 3.8337 4.0395 3.9481 3.9395 3.9378 3.9862 1.0249 1.0239 1.0013 1.0137 1.0020 1.0036 1.0202 1.0031 1.0172 1.0210 1.0186 1.0132 1.0073 1.0123 0.9999 0.9983 0.9995 1.0010
dispcorr: -0.025827127 hartree
energy: -2149.937079398292
dipole: -3.50545 2.48167 -1.02378 -15.22590 15.36966 0.14375 23.87175 -22.30425 1.56750
magnitude: 1.87773 au
magnitude: 4.77280 debye
