program: Orca
programVersion: 5.0.2
elementType: Cl Cl F O O O N C C C C C C C C C C C C C C C C C C C C C C H H H H H H H H H H H H H H H H H H
charge: 0
multiplicity: 1
keywords: wb97x-d3
keywords: def2-TZVPP
keywords: def2/J RIJCOSX
keywords: DEFGRID2
keywords: scfconv7
keywords: smallprint printgap noloewdin
keywords: NOSOSCF
formula: C22H18Cl2FNO3
InChI: InChI=1/C22H18Cl2FNO3/c1-22(2)15(11-19(23)24)20(22)21(27)29-18(12-26)13-8-9-16(25)17(10-13)28-14-6-4-3-5-7-14/h3-11,15,18,20H,1-2H3
47 atoms
Cl -2.845276 3.051031 -2.473857
Cl -5.471745 3.795664 -1.533621
F  4.429227 -2.038668 2.748766
O  0.20389 0.665109 -0.859684
O  0.865129 2.720774 -0.261492
O  2.886267 -3.573902 1.262389
N  1.160082 -1.118152 -3.474788
C  -1.590662 2.513293 1.668203
C  -1.953832 3.332012 0.475411
C  -1.341874 1.967325 0.269184
C  -2.690475 1.818898 2.435636
C  -0.446571 2.967116 2.541418
C  -3.364815 3.571798 0.100107
C  0.017756 1.869455 -0.292447
C  -3.830534 3.482303 -1.138419
C  1.507597 0.378945 -1.363381
C  2.342649 -0.294134 -0.303216
C  1.305684 -0.462763 -2.543316
C  2.208637 -1.657052 -0.057274
C  3.193911 0.474326 0.47682
C  2.915693 -2.25387 0.974287
C  3.908289 -0.117355 1.508401
C  3.757913 -1.46353 1.753713
C  1.781934 -4.317666 0.938079
C  0.515045 -3.955527 1.374287
C  1.977543 -5.476382 0.205494
C  -0.564491 -4.766298 1.06272
C  0.889504 -6.284087 -0.090746
C  -0.382932 -5.931031 0.330995
H  -1.279601 4.157502 0.259949
H  -2.012809 1.174775 -0.04055
H  -3.126935 2.490797 3.177125
H  -3.495741 1.467377 1.79016
H  -2.293778 0.954248 2.969354
H  -0.830111 3.610254 3.335351
H  0.043785 2.115574 3.015857
H  0.307484 3.528498 1.99629
H  -4.061268 3.868078 0.875791
H  1.999539 1.299396 -1.690848
H  1.559455 -2.263294 -0.677917
H  3.295107 1.534931 0.292796
H  4.576303 0.465303 2.12802
H  0.373623 -3.052708 1.954457
H  2.974074 -5.740743 -0.12217
H  -1.553251 -4.486868 1.400988
H  1.040063 -7.190602 -0.661362
H  -1.229188 -6.561121 0.094008
totalener: -2149.91266229 hartree
nucrepener: 2935.47145178 hartree
electener: -5085.38411407 hartree
oneelecener: -8784.22307492 hartree
twoeener: 3698.83896085 hartree
kineticenergy: 2143.53639715 hartree
xcener: -159.168577632366 hartree
chargesum: -0.0000000
charge: -0.026973 -0.038453 -0.183191 -0.252020 -0.388920 -0.285219 -0.001104 0.113610 -0.016894 -0.164520 -0.270485 -0.253734 -0.243861 0.388862 0.089545 0.313341 -0.028509 -0.260531 -0.146929 -0.131317 0.150338 -0.150889 0.194658 0.220083 -0.157103 -0.185438 -0.110661 -0.095384 -0.132484 0.110379 0.106912 0.094780 0.089520 0.095262 0.088835 0.089616 0.102815 0.118462 0.124642 0.136727 0.129292 0.126915 0.129749 0.127959 0.126363 0.128132 0.127823
qa: -0.0270 -0.0385 -0.1832 -0.2520 -0.3889 -0.2852 -0.0011 0.1136 -0.0169 -0.1645 -0.2705 -0.2537 -0.2439 0.3889 0.0895 0.3133 -0.0285 -0.2605 -0.1469 -0.1313 0.1503 -0.1509 0.1947 0.2201 -0.1571 -0.1854 -0.1107 -0.0954 -0.1325 0.1104 0.1069 0.0948 0.0895 0.0953 0.0888 0.0896 0.1028 0.1185 0.1246 0.1367 0.1293 0.1269 0.1297 0.1280 0.1264 0.1281 0.1278
va: 1.3054 1.2672 1.1194 2.1250 2.1107 2.1176 3.1133 3.7227 3.8453 3.8904 3.9157 3.9007 3.9040 4.1586 4.2099 3.8245 3.7641 4.0308 3.9667 3.9110 3.8086 3.9241 4.0866 3.8310 3.9659 4.0432 3.9486 3.9402 3.9626 1.0244 1.0249 1.0015 1.0007 1.0063 1.0032 1.0018 1.0198 1.0170 1.0205 1.0134 1.0192 1.0071 1.0032 1.0120 1.0001 0.9990 1.0000
dispcorr: -0.024560849 hartree
energy: -2149.937223138468
dipole: 4.03780 -4.64976 -0.61196 -9.99903 10.35536 0.35633 21.42387 -19.90693 1.51695
magnitude: 1.67409 au
magnitude: 4.25521 debye
