program: Orca
programVersion: 5.0.2
elementType: Cl Cl F O O O N C C C C C C C C C C C C C C C C C C C C C C H H H H H H H H H H H H H H H H H H
charge: 0
multiplicity: 1
keywords: wb97x-d3
keywords: def2-TZVPP
keywords: def2/J RIJCOSX
keywords: DEFGRID2
keywords: scfconv7
keywords: smallprint printgap noloewdin
keywords: NOSOSCF
formula: C22H18Cl2FNO3
InChI: InChI=1/C22H18Cl2FNO3/c1-22(2)15(11-19(23)24)20(22)21(27)29-18(12-26)13-8-9-16(25)17(10-13)28-14-6-4-3-5-7-14/h3-11,15,18,20H,1-2H3
47 atoms
Cl -2.03861 4.201999 -2.63064
Cl -4.618919 5.405925 -2.158756
F  3.088565 -2.658802 2.878486
O  -0.041193 0.987308 -1.083972
O  0.813142 2.621132 0.182863
O  0.847709 -3.401641 1.507581
N  1.150397 -0.821548 -3.586425
C  -2.077105 2.640933 1.414292
C  -1.93626 3.750245 0.426663
C  -1.56076 2.348132 0.013337
C  -3.456494 2.101208 1.708701
C  -1.151783 2.603428 2.605206
C  -3.113989 4.402892 -0.186113
C  -0.143869 2.041133 -0.252105
C  -3.238227 4.64041 -1.485027
C  1.275765 0.524284 -1.349985
C  1.789223 -0.340283 -0.226899
C  1.187431 -0.226556 -2.604858
C  1.11657 -1.514132 0.098275
C  2.901882 0.043832 0.502942
C  1.550214 -2.298338 1.149629
C  3.35538 -0.744096 1.551365
C  2.675638 -1.899402 1.867911
C  1.445789 -4.631514 1.425108
C  2.483503 -4.906455 0.546693
C  0.929456 -5.624239 2.245218
C  3.009725 -6.189849 0.503128
C  1.461423 -6.901037 2.18495
C  2.506305 -7.19085 1.318175
H  -1.085742 4.407771 0.590883
H  -2.259111 1.828319 -0.631977
H  -4.108619 2.114876 0.834971
H  -3.395102 1.070186 2.059078
H  -3.938883 2.687514 2.493176
H  -0.986881 1.577214 2.937345
H  -0.181924 3.05054 2.403818
H  -1.604406 3.149207 3.434656
H  -3.918163 4.731692 0.461835
H  1.958021 1.365296 -1.509696
H  0.244132 -1.831737 -0.460022
H  3.414819 0.966794 0.268417
H  4.219919 -0.45569 2.133571
H  2.877343 -4.140197 -0.10884
H  0.120193 -5.38935 2.924152
H  3.81909 -6.404122 -0.182431
H  1.059416 -7.673128 2.827588
H  2.922167 -8.188288 1.277335
totalener: -2149.91239079 hartree
nucrepener: 2903.72274376 hartree
electener: -5053.63513455 hartree
oneelecener: -8720.80827569 hartree
twoeener: 3667.17314115 hartree
kineticenergy: 2143.54246281 hartree
xcener: -159.168046352333 hartree
chargesum: -0.0000000
charge: -0.029320 -0.037725 -0.183803 -0.261868 -0.378961 -0.299398 0.001485 0.110486 -0.012804 -0.161521 -0.268305 -0.248992 -0.248008 0.372163 0.093127 0.335178 -0.017763 -0.264013 -0.163090 -0.086035 0.081263 -0.158332 0.257736 0.247098 -0.127203 -0.198361 -0.137480 -0.098037 -0.137495 0.109109 0.109357 0.089104 0.097625 0.093754 0.091415 0.101914 0.087032 0.119516 0.119987 0.127232 0.117829 0.128914 0.128816 0.122163 0.126683 0.124365 0.125163
qa: -0.0293 -0.0377 -0.1838 -0.2619 -0.3790 -0.2994 0.0015 0.1105 -0.0128 -0.1615 -0.2683 -0.2490 -0.2480 0.3722 0.0931 0.3352 -0.0178 -0.2640 -0.1631 -0.0860 0.0813 -0.1583 0.2577 0.2471 -0.1272 -0.1984 -0.1375 -0.0980 -0.1375 0.1091 0.1094 0.0891 0.0976 0.0938 0.0914 0.1019 0.0870 0.1195 0.1200 0.1272 0.1178 0.1289 0.1288 0.1222 0.1267 0.1244 0.1252
va: 1.3041 1.2682 1.1167 2.1279 2.1261 2.1011 3.1179 3.7332 3.8404 3.8890 3.9151 3.9008 3.9108 4.1634 4.2054 3.8257 3.6602 4.0215 4.0195 3.9380 3.8838 3.9451 4.0288 3.7851 3.9086 4.0303 3.9819 3.9572 3.9562 1.0253 1.0240 1.0006 1.0064 1.0015 1.0018 1.0199 1.0031 1.0172 1.0184 1.0261 1.0155 1.0069 1.0076 1.0143 1.0006 0.9988 1.0000
dispcorr: -0.024540729 hartree
energy: -2149.936931514694
dipole: 5.43367 -5.58124 -0.14757 -19.15401 19.51750 0.36349 23.30312 -21.76312 1.53999
magnitude: 1.58918 au
magnitude: 4.03937 debye
