program: Orca
programVersion: 5.0.2
elementType: Cl Cl F O O O N C C C C C C C C C C C C C C C C C C C C C C H H H H H H H H H H H H H H H H H H
charge: 0
multiplicity: 1
keywords: wb97x-d3
keywords: def2-TZVPP
keywords: def2/J RIJCOSX
keywords: DEFGRID2
keywords: scfconv7
keywords: smallprint printgap noloewdin
keywords: NOSOSCF
formula: C22H18Cl2FNO3
InChI: InChI=1/C22H18Cl2FNO3/c1-22(2)15(11-19(23)24)20(22)21(27)29-18(12-26)13-8-9-16(25)17(10-13)28-14-6-4-3-5-7-14/h3-11,15,18,20H,1-2H3
47 atoms
Cl -2.707379 3.804321 -2.483145
Cl -5.281244 4.597256 -1.445864
F  4.353809 -1.284526 2.881535
O  0.106445 0.748596 -1.16757
O  0.852991 2.734126 -0.453921
O  2.29528 -2.745514 2.111813
N  1.202885 -1.472973 -3.369357
C  -1.625264 2.351186 1.47389
C  -1.876168 3.420712 0.46262
C  -1.402504 2.070492 -0.005748
C  -2.805136 1.641087 2.092673
C  -0.451626 2.492733 2.411733
C  -3.247893 3.869518 0.137082
C  -0.037499 1.934848 -0.547878
C  -3.68709 4.062565 -1.099403
C  1.427592 0.41033 -1.572079
C  2.249894 -0.059933 -0.398572
C  1.280976 -0.642593 -2.579864
C  1.871598 -1.217696 0.276777
C  3.332817 0.681949 0.036832
C  2.5871 -1.646224 1.38181
C  4.050893 0.264374 1.149396
C  3.675529 -0.883231 1.80848
C  1.454308 -3.695613 1.588961
C  1.802673 -4.408481 0.449874
C  0.268573 -3.95457 2.255373
C  0.941722 -5.384618 -0.025868
C  -0.579319 -4.9426 1.775453
C  -0.249716 -5.654907 0.632838
H  -1.119315 4.200087 0.414529
H  -2.137439 1.418989 -0.464306
H  -3.637992 1.52624 1.398571
H  -2.515963 0.644572 2.428996
H  -3.170069 2.189541 2.963345
H  -0.064117 1.513613 2.698348
H  0.368815 3.064803 1.985554
H  -0.770217 3.000748 3.323265
H  -3.932693 4.078327 0.950595
H  1.917414 1.264339 -2.050623
H  1.018924 -1.791089 -0.066292
H  3.613936 1.592547 -0.473615
H  4.899675 0.829269 1.509985
H  2.734878 -4.203063 -0.060802
H  0.020217 -3.392003 3.145518
H  1.20732 -5.938448 -0.916221
H  -1.504511 -5.150093 2.296391
H  -0.915991 -6.419483 0.257173
totalener: -2149.91225299 hartree
nucrepener: 2959.53507234 hartree
electener: -5109.44732533 hartree
oneelecener: -8832.46135133 hartree
twoeener: 3723.01402600 hartree
kineticenergy: 2143.53520830 hartree
xcener: -159.168139952483 hartree
chargesum: -0.0000000
charge: -0.030061 -0.039145 -0.184293 -0.257882 -0.371690 -0.284519 -0.002240 0.112276 -0.007770 -0.156580 -0.270559 -0.247872 -0.249966 0.359656 0.090972 0.337722 -0.022273 -0.267904 -0.181582 -0.118100 0.173756 -0.139191 0.183176 0.221447 -0.160436 -0.180431 -0.107788 -0.108146 -0.126806 0.109532 0.107327 0.089010 0.095436 0.094510 0.090091 0.100191 0.088635 0.119301 0.118663 0.132458 0.115481 0.126720 0.135603 0.125549 0.131568 0.127249 0.128902
qa: -0.0301 -0.0391 -0.1843 -0.2579 -0.3717 -0.2845 -0.0022 0.1123 -0.0078 -0.1566 -0.2706 -0.2479 -0.2500 0.3597 0.0910 0.3377 -0.0223 -0.2679 -0.1816 -0.1181 0.1738 -0.1392 0.1832 0.2214 -0.1604 -0.1804 -0.1078 -0.1081 -0.1268 0.1095 0.1073 0.0890 0.0954 0.0945 0.0901 0.1002 0.0886 0.1193 0.1187 0.1325 0.1155 0.1267 0.1356 0.1255 0.1316 0.1272 0.1289
va: 1.3021 1.2671 1.1174 2.1318 2.1322 2.1197 3.1197 3.7432 3.8349 3.8696 3.9115 3.8999 3.9097 4.1988 4.2077 3.8328 3.7251 4.0293 3.9435 3.9392 3.7696 3.9210 4.0907 3.8159 3.9805 4.0321 3.9492 3.9392 3.9513 1.0256 1.0241 1.0007 1.0064 1.0012 1.0019 1.0193 1.0038 1.0165 1.0184 1.0207 1.0186 1.0069 1.0023 1.0115 0.9993 0.9993 0.9997
dispcorr: -0.025307968 hartree
energy: -2149.937560962448
dipole: 3.85341 -4.40056 -0.54715 -16.20474 16.44040 0.23566 19.62712 -18.39956 1.22755
magnitude: 1.36447 au
magnitude: 3.46822 debye
