program: Orca
programVersion: 5.0.2
elementType: Cl Cl F O O O N C C C C C C C C C C C C C C C C C C C C C C H H H H H H H H H H H H H H H H H H
charge: 0
multiplicity: 1
keywords: wb97x-d3
keywords: def2-TZVPP
keywords: def2/J RIJCOSX
keywords: DEFGRID2
keywords: scfconv7
keywords: smallprint printgap noloewdin
keywords: NOSOSCF
formula: C22H18Cl2FNO3
InChI: InChI=1/C22H18Cl2FNO3/c1-22(2)15(11-19(23)24)20(22)21(27)29-18(12-26)13-8-9-16(25)17(10-13)28-14-6-4-3-5-7-14/h3-11,15,18,20H,1-2H3
47 atoms
Cl -1.768834 3.797203 -2.439014
Cl -4.532676 4.622699 -2.542064
F  4.031315 -3.291951 1.934207
O  0.230161 0.892176 -0.798479
O  0.58629 2.389575 0.828694
O  2.443816 -3.944896 -0.183324
N  1.905785 0.387441 -3.602405
C  -2.465318 1.989826 1.442886
C  -2.291046 3.152094 0.526207
C  -1.648538 1.827227 0.172941
C  -3.78728 1.258685 1.44004
C  -1.802778 2.026897 2.797748
C  -3.390744 3.676868 -0.312808
C  -0.175725 1.757595 0.148397
C  -3.249374 3.990278 -1.594207
C  1.629599 0.797292 -1.036598
C  2.263954 -0.305505 -0.229948
C  1.772107 0.564608 -2.47588
C  2.030076 -1.638225 -0.55484
C  3.064357 0.008642 0.857717
C  2.618625 -2.649789 0.179957
C  3.662107 -0.99939 1.60049
C  3.444598 -2.31395 1.250014
C  1.785456 -4.790933 0.668009
C  0.886325 -4.347713 1.627058
C  2.028755 -6.146789 0.499396
C  0.236086 -5.278129 2.425621
C  1.368478 -7.061881 1.301096
C  0.47121 -6.63438 2.270277
H  -1.586062 3.905619 0.869414
H  -2.131693 1.258779 -0.612935
H  -3.654447 0.228168 1.771679
H  -4.492252 1.736349 2.123104
H  -4.248575 1.23046 0.452517
H  -2.479976 2.483908 3.521303
H  -1.580258 1.017697 3.147882
H  -0.876254 2.594654 2.802923
H  -4.359494 3.845519 0.14286
H  2.12027 1.747079 -0.803083
H  1.408175 -1.907975 -1.400129
H  3.228435 1.04261 1.129985
H  4.303642 -0.76866 2.439984
H  0.680635 -3.292565 1.753864
H  2.732984 -6.472858 -0.254357
H  -0.463959 -4.93177 3.174375
H  1.562876 -8.118055 1.169587
H  -0.03896 -7.352449 2.897537
totalener: -2149.91196668 hartree
nucrepener: 2909.69632131 hartree
electener: -5059.60828798 hartree
oneelecener: -8732.62587637 hartree
twoeener: 3673.01758838 hartree
kineticenergy: 2143.53543576 hartree
xcener: -159.166699638045 hartree
chargesum: -0.0000000
charge: -0.027106 -0.036884 -0.183449 -0.256353 -0.388756 -0.294762 0.001423 0.116589 -0.025717 -0.161498 -0.266365 -0.248243 -0.247095 0.379315 0.095315 0.332021 -0.034631 -0.262160 -0.149402 -0.082841 0.085610 -0.167712 0.258863 0.253523 -0.134206 -0.200488 -0.136734 -0.093947 -0.140779 0.110552 0.109237 0.095920 0.094431 0.088755 0.087034 0.087578 0.102393 0.119978 0.119233 0.127119 0.124799 0.129132 0.122677 0.124888 0.123282 0.124595 0.124865
qa: -0.0271 -0.0369 -0.1834 -0.2564 -0.3888 -0.2948 0.0014 0.1166 -0.0257 -0.1615 -0.2664 -0.2482 -0.2471 0.3793 0.0953 0.3320 -0.0346 -0.2622 -0.1494 -0.0828 0.0856 -0.1677 0.2589 0.2535 -0.1342 -0.2005 -0.1367 -0.0939 -0.1408 0.1106 0.1092 0.0959 0.0944 0.0888 0.0870 0.0876 0.1024 0.1200 0.1192 0.1271 0.1248 0.1291 0.1227 0.1249 0.1233 0.1246 0.1249
va: 1.3095 1.2692 1.1180 2.1240 2.1114 2.1080 3.1148 3.7228 3.8516 3.8845 3.9168 3.8995 3.9101 4.1596 4.2039 3.8200 3.6995 4.0199 4.0390 3.9178 3.8927 3.9534 4.0386 3.7870 3.9095 4.0304 3.9858 3.9545 3.9606 1.0243 1.0244 1.0065 1.0014 1.0008 1.0025 1.0023 1.0206 1.0169 1.0219 1.0243 1.0171 1.0073 1.0097 1.0141 1.0012 0.9988 1.0002
dispcorr: -0.024297466 hartree
energy: -2149.936264143457
dipole: -5.20661 4.27496 -0.93165 -18.22115 18.24600 0.02484 28.06372 -26.12960 1.93413
magnitude: 2.14696 au
magnitude: 5.45714 debye
