program: Orca
programVersion: 5.0.2
elementType: Cl Cl F O O O N C C C C C C C C C C C C C C C C C C C C C C H H H H H H H H H H H H H H H H H H
charge: 0
multiplicity: 1
keywords: wb97x-d3
keywords: def2-TZVPP
keywords: def2/J RIJCOSX
keywords: DEFGRID2
keywords: scfconv7
keywords: smallprint printgap noloewdin
keywords: NOSOSCF
formula: C22H18Cl2FNO3
InChI: InChI=1/C22H18Cl2FNO3/c1-22(2)15(11-19(23)24)20(22)21(27)29-18(12-26)13-8-9-16(25)17(10-13)28-14-6-4-3-5-7-14/h3-11,15,18,20H,1-2H3
47 atoms
Cl -2.733034 3.15845 -2.600635
Cl -5.233617 4.241839 -1.649311
F  4.820089 -1.685569 2.366377
O  0.133991 0.688508 -0.993643
O  1.011624 2.697843 -0.545413
O  2.65957 -3.080734 1.789816
N  0.79643 -1.543891 -3.347775
C  -1.356569 2.842399 1.509323
C  -1.694773 3.610701 0.275979
C  -1.221563 2.183272 0.145202
C  -2.482982 2.311923 2.363986
C  -0.137664 3.239119 2.305437
C  -3.090611 3.958014 -0.070505
C  0.090645 1.929843 -0.478143
C  -3.614818 3.805538 -1.279299
C  1.370776 0.28447 -1.571232
C  2.317368 -0.248333 -0.526014
C  1.031409 -0.738845 -2.563087
C  2.021806 -1.446258 0.119059
C  3.447698 0.471111 -0.179114
C  2.86767 -1.939291 1.097174
C  4.298728 -0.013743 0.805367
C  4.00738 -1.205626 1.427656
C  1.807728 -4.024994 1.27378
C  0.676844 -4.353767 2.001382
C  2.095197 -4.660358 0.073886
C  -0.176945 -5.336653 1.521171
C  1.229201 -5.632446 -0.400023
C  0.09226 -5.973294 0.31975
H  -0.956152 4.351069 -0.022213
H  -1.976299 1.439223 -0.080815
H  -2.152233 1.442334 2.933306
H  -2.811133 3.068473 3.079541
H  -3.350577 2.011565 1.775893
H  0.273319 2.380925 2.839623
H  0.653217 3.661959 1.69155
H  -0.417195 3.986757 3.049811
H  -3.721248 4.390706 0.697407
H  1.838383 1.120279 -2.100653
H  1.133368 -2.004245 -0.151703
H  3.667234 1.412988 -0.662612
H  5.189609 0.530088 1.088903
H  0.475403 -3.848894 2.936905
H  2.984448 -4.397208 -0.484728
H  -1.059659 -5.599256 2.088775
H  1.446937 -6.126247 -1.337436
H  -0.579178 -6.733512 -0.055356
totalener: -2149.91298359 hartree
nucrepener: 2936.65188495 hartree
electener: -5086.56486854 hartree
oneelecener: -8786.80410970 hartree
twoeener: 3700.23924116 hartree
kineticenergy: 2143.53726351 hartree
xcener: -159.168570724530 hartree
chargesum: -0.0000000
charge: -0.028837 -0.038583 -0.183971 -0.258467 -0.384697 -0.286073 -0.002702 0.109385 -0.013537 -0.162096 -0.268438 -0.249819 -0.248056 0.381329 0.092830 0.333397 -0.031547 -0.267811 -0.155307 -0.114092 0.153133 -0.145401 0.191725 0.209148 -0.177332 -0.148800 -0.109484 -0.109880 -0.124403 0.108910 0.107886 0.096770 0.093718 0.088745 0.090520 0.102694 0.086867 0.119465 0.119490 0.130729 0.118834 0.126438 0.126161 0.134850 0.127163 0.130617 0.128529
qa: -0.0288 -0.0386 -0.1840 -0.2585 -0.3847 -0.2861 -0.0027 0.1094 -0.0135 -0.1621 -0.2684 -0.2498 -0.2481 0.3813 0.0928 0.3334 -0.0315 -0.2678 -0.1553 -0.1141 0.1531 -0.1454 0.1917 0.2091 -0.1773 -0.1488 -0.1095 -0.1099 -0.1244 0.1089 0.1079 0.0968 0.0937 0.0887 0.0905 0.1027 0.0869 0.1195 0.1195 0.1307 0.1188 0.1264 0.1262 0.1349 0.1272 0.1306 0.1285
va: 1.3044 1.2671 1.1182 2.1311 2.1174 2.1167 3.1175 3.7316 3.8388 3.8909 3.9150 3.9005 3.9082 4.1623 4.2052 3.8352 3.7329 4.0279 3.9418 3.9292 3.7845 3.9247 4.0865 3.8321 4.0276 3.9800 3.9404 3.9547 3.9505 1.0257 1.0243 1.0061 1.0016 1.0008 1.0016 1.0201 1.0028 1.0170 1.0198 1.0187 1.0189 1.0070 1.0111 1.0019 0.9994 0.9996 0.9997
dispcorr: -0.024670568 hartree
energy: -2149.937654155503
dipole: 5.50853 -5.91061 -0.40207 -9.91220 10.39086 0.47866 20.72782 -19.47689 1.25093
magnitude: 1.39843 au
magnitude: 3.55453 debye
