program: Orca
programVersion: 5.0.2
elementType: Cl Cl F O O O N C C C C C C C C C C C C C C C C C C C C C C H H H H H H H H H H H H H H H H H H
charge: 0
multiplicity: 1
keywords: wb97x-d3
keywords: def2-TZVPP
keywords: def2/J RIJCOSX
keywords: DEFGRID2
keywords: scfconv7
keywords: smallprint printgap noloewdin
keywords: NOSOSCF
formula: C22H18Cl2FNO3
InChI: InChI=1/C22H18Cl2FNO3/c1-22(2)15(11-19(23)24)20(22)21(27)29-18(12-26)13-8-9-16(25)17(10-13)28-14-6-4-3-5-7-14/h3-11,15,18,20H,1-2H3
47 atoms
Cl -5.136771 1.421089 0.70703
Cl -5.564459 4.21877 0.148151
F  4.476533 -2.772564 -1.956079
O  1.258615 2.026956 0.40485
O  -0.154447 0.32094 0.71806
O  3.070355 -3.435056 0.177566
N  4.016284 3.111001 1.862839
C  -1.50824 1.628766 -1.815206
C  -2.305887 1.882602 -0.56957
C  -0.828398 2.209515 -0.589522
C  -1.65231 2.558562 -2.996241
C  -1.262807 0.195726 -2.220689
C  -3.280253 2.976981 -0.466812
C  0.083532 1.396841 0.240529
C  -4.494655 2.876777 0.060033
C  2.255819 1.321544 1.139436
C  2.89013 0.228145 0.316724
C  3.235263 2.334648 1.536947
C  2.675334 -1.096937 0.667304
C  3.644882 0.54024 -0.806459
C  3.201262 -2.120587 -0.106567
C  4.188457 -0.475202 -1.575303
C  3.96007 -1.789853 -1.223998
C  1.91032 -3.939281 0.697029
C  0.655001 -3.428358 0.393786
C  2.042402 -5.049389 1.518927
C  -0.468404 -4.035721 0.935164
C  0.909894 -5.651283 2.041676
C  -0.350393 -5.14555 1.757445
H  -2.553026 0.990114 -0.006308
H  -0.551252 3.254975 -0.66827
H  -1.747934 3.605241 -2.710179
H  -0.782329 2.479415 -3.649397
H  -2.534219 2.295685 -3.582216
H  -1.238934 -0.487786 -1.37553
H  -2.058391 -0.134406 -2.890157
H  -0.317888 0.102383 -2.759112
H  -2.99769 3.9537 -0.839717
H  1.827069 0.895425 2.052229
H  2.07748 -1.336384 1.537146
H  3.822211 1.571737 -1.082527
H  4.786174 -0.254571 -2.449294
H  0.541994 -2.564791 -0.24858
H  3.029332 -5.435978 1.736506
H  -1.445427 -3.632068 0.705162
H  1.016669 -6.518143 2.680151
H  -1.232807 -5.612737 2.172685
totalener: -2149.91363622 hartree
nucrepener: 2926.88287864 hartree
electener: -5076.79651486 hartree
oneelecener: -8766.66881777 hartree
twoeener: 3689.87230291 hartree
kineticenergy: 2143.52749563 hartree
xcener: -159.168761568242 hartree
chargesum: -0.0000000
charge: -0.038950 -0.041890 -0.181463 -0.253014 -0.383277 -0.286743 0.001389 0.068078 0.044177 -0.092252 -0.242442 -0.243335 -0.207069 0.354421 0.052872 0.312378 -0.003690 -0.258061 -0.150101 -0.169356 0.187157 -0.146197 0.190504 0.278659 -0.179946 -0.222001 -0.112018 -0.084702 -0.144932 0.087846 0.084796 0.074010 0.094934 0.100800 0.084167 0.095131 0.093051 0.098503 0.118344 0.132093 0.125035 0.128747 0.129183 0.127390 0.125618 0.126650 0.125508
qa: -0.0390 -0.0419 -0.1815 -0.2530 -0.3833 -0.2867 0.0014 0.0681 0.0442 -0.0923 -0.2424 -0.2433 -0.2071 0.3544 0.0529 0.3124 -0.0037 -0.2581 -0.1501 -0.1694 0.1872 -0.1462 0.1905 0.2787 -0.1799 -0.2220 -0.1120 -0.0847 -0.1449 0.0878 0.0848 0.0740 0.0949 0.1008 0.0842 0.0951 0.0931 0.0985 0.1183 0.1321 0.1250 0.1287 0.1292 0.1274 0.1256 0.1266 0.1255
va: 1.2883 1.2635 1.1222 2.1418 2.1185 2.1322 3.1176 3.7622 3.8227 3.8696 3.9094 3.9187 3.9234 4.2418 4.2515 3.8490 3.6485 4.0163 3.9224 3.9895 3.7863 3.9042 4.1083 3.7937 3.9443 4.0349 3.9559 3.9321 3.9702 1.0496 1.0345 1.0099 1.0042 1.0027 1.0195 1.0042 1.0011 1.0297 1.0172 1.0149 1.0148 1.0066 0.9987 1.0141 1.0001 0.9986 1.0004
dispcorr: -0.024668343 hartree
energy: -2149.938304564450
dipole: 9.51717 -10.30521 -0.78804 -11.88024 11.58362 -0.29662 -10.46454 9.53880 -0.92575
magnitude: 1.25140 au
magnitude: 3.18081 debye
