program: Orca
programVersion: 5.0.2
elementType: Cl Cl F O O O N C C C C C C C C C C C C C C C C C C C C C C H H H H H H H H H H H H H H H H H H
charge: 0
multiplicity: 1
keywords: wb97x-d3
keywords: def2-TZVPP
keywords: def2/J RIJCOSX
keywords: DEFGRID2
keywords: scfconv7
keywords: smallprint printgap noloewdin
keywords: NOSOSCF
formula: C22H18Cl2FNO3
InChI: InChI=1/C22H18Cl2FNO3/c1-22(2)15(11-19(23)24)20(22)21(27)29-18(12-26)13-8-9-16(25)17(10-13)28-14-6-4-3-5-7-14/h3-11,15,18,20H,1-2H3
47 atoms
Cl -5.339044 1.286322 -0.010878
Cl -5.695479 4.141485 -0.245956
F  4.664395 -2.687707 -1.657008
O  1.20038 2.089548 0.455999
O  -0.178395 0.349165 0.733413
O  3.299195 -3.319238 0.530683
N  3.907169 3.246815 1.957379
C  -1.486104 1.63387 -1.845316
C  -2.329028 1.878368 -0.62731
C  -0.858837 2.223758 -0.595708
C  -1.610632 2.565133 -3.027145
C  -1.205323 0.205643 -2.242439
C  -3.317312 2.966739 -0.569974
C  0.045527 1.429614 0.260429
C  -4.609949 2.811489 -0.312582
C  2.189901 1.418109 1.228289
C  2.873824 0.321836 0.450129
C  3.141519 2.45605 1.630497
C  2.747836 -0.992129 0.872941
C  3.605701 0.619571 -0.692652
C  3.344427 -2.020529 0.158133
C  4.215432 -0.398582 -1.405303
C  4.078847 -1.704796 -0.978773
C  2.135943 -3.888733 0.9697
C  2.277393 -4.989441 1.803323
C  0.875624 -3.449895 0.585779
C  1.149794 -5.655301 2.253382
C  -0.24396 -4.122633 1.05405
C  -0.116543 -5.224312 1.885003
H  -2.59229 0.98285 -0.075238
H  -0.59586 3.273598 -0.666983
H  -0.717389 2.510061 -3.650784
H  -2.466092 2.284671 -3.643333
H  -1.74353 3.607094 -2.738431
H  -0.245765 0.128926 -2.75714
H  -1.189727 -0.47693 -1.396272
H  -1.978106 -0.138795 -2.931131
H  -2.97863 3.980437 -0.745956
H  1.74596 1.00117 2.138253
H  2.167257 -1.224445 1.756731
H  3.7146 1.643591 -1.026026
H  4.79635 -0.187804 -2.292952
H  3.268463 -5.318593 2.086447
H  0.752315 -2.593201 -0.063712
H  1.264684 -6.514025 2.90136
H  -1.225366 -3.775702 0.759418
H  -0.995648 -5.742355 2.242798
totalener: -2149.91335807 hartree
nucrepener: 2915.93570887 hartree
electener: -5065.84906694 hartree
oneelecener: -8744.75928316 hartree
twoeener: 3678.91021622 hartree
kineticenergy: 2143.52761349 hartree
xcener: -159.167984585427 hartree
chargesum: 0.0000000
charge: -0.038484 -0.040245 -0.181184 -0.254816 -0.378495 -0.288293 0.002246 0.077614 0.032886 -0.108471 -0.232813 -0.246695 -0.198819 0.350131 0.043599 0.312613 0.003253 -0.256403 -0.144722 -0.171766 0.180061 -0.148186 0.194737 0.280407 -0.224348 -0.176416 -0.083288 -0.115413 -0.148320 0.093168 0.084835 0.094833 0.100070 0.073119 0.092082 0.087920 0.094548 0.103337 0.117451 0.129269 0.126425 0.128510 0.126610 0.130049 0.126315 0.125286 0.125806
qa: -0.0385 -0.0402 -0.1812 -0.2548 -0.3785 -0.2883 0.0022 0.0776 0.0329 -0.1085 -0.2328 -0.2467 -0.1988 0.3501 0.0436 0.3126 0.0033 -0.2564 -0.1447 -0.1718 0.1801 -0.1482 0.1947 0.2804 -0.2243 -0.1764 -0.0833 -0.1154 -0.1483 0.0932 0.0848 0.0948 0.1001 0.0731 0.0921 0.0879 0.0945 0.1033 0.1175 0.1293 0.1264 0.1285 0.1266 0.1300 0.1263 0.1253 0.1258
va: 1.2890 1.2659 1.1231 2.1399 2.1255 2.1304 3.1177 3.7577 3.8205 3.8931 3.9047 3.9172 3.8944 4.2401 4.2464 3.8470 3.6415 4.0158 3.9301 3.9835 3.7871 3.9028 4.1142 3.7885 4.0341 3.9349 3.9336 3.9615 3.9706 1.0441 1.0362 1.0045 1.0038 1.0091 1.0014 1.0192 1.0042 1.0249 1.0181 1.0144 1.0147 1.0065 1.0144 1.0010 0.9986 1.0002 1.0003
dispcorr: -0.024562647 hartree
energy: -2149.937920720046
dipole: 10.71877 -11.47591 -0.75714 -11.65055 11.36934 -0.28121 -8.00493 7.12148 -0.88344
magnitude: 1.19700 au
magnitude: 3.04254 debye
