program: Orca
programVersion: 5.0.2
elementType: Cl Cl F O O O N C C C C C C C C C C C C C C C C C C C C C C H H H H H H H H H H H H H H H H H H
charge: 0
multiplicity: 1
keywords: wb97x-d3
keywords: def2-TZVPP
keywords: def2/J RIJCOSX
keywords: DEFGRID2
keywords: scfconv7
keywords: smallprint printgap noloewdin
keywords: NOSOSCF
formula: C22H18Cl2FNO3
InChI: InChI=1/C22H18Cl2FNO3/c1-22(2)15(11-19(23)24)20(22)21(27)29-18(12-26)13-8-9-16(25)17(10-13)28-14-6-4-3-5-7-14/h3-11,15,18,20H,1-2H3
47 atoms
Cl -2.302127 -0.828854 2.465224
Cl -4.468606 0.738487 3.537003
F  4.062181 -3.340708 0.485889
O  0.92007 1.894696 -0.061653
O  0.860616 4.127701 -0.021211
O  1.957912 -2.933811 -1.076873
N  2.718485 2.621541 -2.826223
C  -2.061179 2.216792 -0.832515
C  -1.858672 1.628534 0.535878
C  -1.179961 2.934173 0.170917
C  -3.361335 2.905938 -1.175845
C  -1.468146 1.4816 -2.011132
C  -2.919112 1.632657 1.550364
C  0.285245 3.078324 0.023004
C  -3.187403 0.646104 2.396802
C  2.310903 1.906884 -0.34083
C  2.817396 0.50462 -0.124882
C  2.532482 2.328787 -1.731072
C  2.158123 -0.549795 -0.74649
C  3.906954 0.25875 0.690854
C  2.557539 -1.85525 -0.526646
C  4.341208 -1.046699 0.886661
C  3.665507 -2.08607 0.288943
C  0.64821 -2.838687 -1.473367
C  -0.345308 -2.425185 -0.594494
C  0.339144 -3.208181 -2.77132
C  -1.658492 -2.374269 -1.033681
C  -0.981695 -3.165816 -3.194323
C  -1.981615 -2.742686 -2.332465
H  -1.209017 0.761987 0.558204
H  -1.615571 3.837794 0.582626
H  -3.221721 3.560878 -2.036737
H  -4.126862 2.173079 -1.435356
H  -3.751028 3.521091 -0.365777
H  -1.140344 2.179409 -2.783408
H  -0.625062 0.850253 -1.744927
H  -2.222931 0.828688 -2.451468
H  -3.551648 2.508576 1.624724
H  2.835743 2.609895 0.313246
H  1.320127 -0.355696 -1.403216
H  4.423712 1.072961 1.181695
H  5.192248 -1.260944 1.518585
H  -0.099842 -2.145229 0.42225
H  1.12753 -3.530655 -3.438354
H  -2.432036 -2.052394 -0.349167
H  -1.224749 -3.459675 -4.206653
H  -3.009416 -2.707301 -2.667272
totalener: -2149.90987497 hartree
nucrepener: 3074.19934370 hartree
electener: -5224.10921867 hartree
oneelecener: -9060.97327258 hartree
twoeener: 3836.86405391 hartree
kineticenergy: 2143.52435225 hartree
xcener: -159.168033205569 hartree
chargesum: -0.0000000
charge: -0.054188 -0.040963 -0.181808 -0.264380 -0.329417 -0.286368 0.005026 0.100161 0.091764 -0.095639 -0.254098 -0.240042 -0.220981 0.326500 0.070069 0.255732 0.037186 -0.240414 -0.187301 -0.139727 0.159024 -0.140600 0.185349 0.239686 -0.172125 -0.193575 -0.100411 -0.085079 -0.158406 0.053900 0.082090 0.100402 0.097368 0.073891 0.116492 0.039828 0.091366 0.097354 0.114717 0.163019 0.115705 0.126214 0.132783 0.129654 0.120927 0.129317 0.129999
qa: -0.0542 -0.0410 -0.1818 -0.2644 -0.3294 -0.2864 0.0050 0.1002 0.0918 -0.0956 -0.2541 -0.2400 -0.2210 0.3265 0.0701 0.2557 0.0372 -0.2404 -0.1873 -0.1397 0.1590 -0.1406 0.1853 0.2397 -0.1721 -0.1936 -0.1004 -0.0851 -0.1584 0.0539 0.0821 0.1004 0.0974 0.0739 0.1165 0.0398 0.0914 0.0974 0.1147 0.1630 0.1157 0.1262 0.1328 0.1297 0.1209 0.1293 0.1300
va: 1.2813 1.2651 1.1222 2.1253 2.1757 2.1302 3.1080 3.7122 3.7801 3.8834 3.9205 3.9413 3.9192 4.2903 4.2124 3.9325 3.7341 3.9589 3.9354 3.9465 3.8054 3.9322 4.1079 3.8495 3.9174 4.0453 3.8589 3.9268 3.9897 1.0404 1.0321 1.0031 1.0018 1.0105 1.0066 1.0195 1.0056 1.0318 1.0247 0.9849 1.0097 1.0078 1.0048 1.0120 1.0175 0.9978 1.0000
dispcorr: -0.028670281 hartree
energy: -2149.938545251994
dipole: -6.38685 5.36154 -1.02531 10.57731 -10.86481 -0.28750 -24.15169 24.57621 0.42452
magnitude: 1.14635 au
magnitude: 2.91380 debye
