program: Orca
programVersion: 5.0.2
elementType: Cl Cl F O O O N C C C C C C C C C C C C C C C C C C C C C C H H H H H H H H H H H H H H H H H H
charge: 0
multiplicity: 1
keywords: wb97x-d3
keywords: def2-TZVPP
keywords: def2/J RIJCOSX
keywords: DEFGRID2
keywords: scfconv7
keywords: smallprint printgap noloewdin
keywords: NOSOSCF
formula: C22H18Cl2FNO3
InChI: InChI=1/C22H18Cl2FNO3/c1-22(2)15(11-19(23)24)20(22)21(27)29-18(12-26)13-8-9-16(25)17(10-13)28-14-6-4-3-5-7-14/h3-11,15,18,20H,1-2H3
47 atoms
Cl -2.682543 3.74656 -1.66044
Cl -5.466911 3.65203 -0.909167
F  4.639728 -2.297323 2.308773
O  0.563453 0.80936 -1.318227
O  0.75166 2.21777 0.410631
O  2.314909 -3.140576 1.431536
N  2.4695 -0.119237 -3.85838
C  -1.867294 0.592734 1.200395
C  -2.178721 2.017048 0.868893
C  -1.361641 1.206303 -0.097039
C  -2.94457 -0.451779 1.033397
C  -0.914663 0.297852 2.332124
C  -3.550861 2.438137 0.510203
C  0.072642 1.501727 -0.269277
C  -3.856473 3.176948 -0.547767
C  1.969962 0.837578 -1.477757
C  2.682505 0.006832 -0.434763
C  2.227394 0.299908 -2.816799
C  2.119534 -1.193657 -0.010618
C  3.897532 0.429052 0.06963
C  2.776356 -1.974611 0.9257
C  4.569013 -0.356063 0.997257
C  4.0097 -1.540679 1.413166
C  1.116849 -3.63938 0.989853
C  0.020777 -3.571669 1.834585
C  1.020462 -4.239628 -0.257024
C  -1.188996 -4.113051 1.42298
C  -0.195587 -4.768715 -0.661113
C  -1.302318 -4.705828 0.174317
H  -1.609558 2.756462 1.427792
H  -1.858084 0.850354 -0.992455
H  -2.497742 -1.428688 0.841167
H  -3.545436 -0.53442 1.941449
H  -3.619675 -0.226723 0.207528
H  -0.392326 -0.644945 2.160288
H  -0.165436 1.07298 2.475491
H  -1.472368 0.200831 3.265221
H  -4.362912 2.147724 1.166627
H  2.347846 1.865371 -1.445466
H  1.166822 -1.516944 -0.409816
H  4.328268 1.369481 -0.247498
H  5.520638 -0.046221 1.407345
H  0.122469 -3.114965 2.810546
H  1.888329 -4.294982 -0.901855
H  -2.04461 -4.070944 2.084161
H  -0.275031 -5.236727 -1.633076
H  -2.246879 -5.125187 -0.144529
totalener: -2149.91064100 hartree
nucrepener: 3031.84485482 hartree
electener: -5181.75549583 hartree
oneelecener: -8976.72666130 hartree
twoeener: 3794.97116547 hartree
kineticenergy: 2143.54212803 hartree
xcener: -159.170982804659 hartree
chargesum: -0.0000000
charge: -0.029367 -0.039550 -0.185338 -0.268643 -0.351812 -0.282864 -0.000610 0.132489 -0.002319 -0.160065 -0.276783 -0.236532 -0.257598 0.331051 0.093945 0.305577 0.036676 -0.253363 -0.227942 -0.151866 0.213127 -0.130352 0.181923 0.258353 -0.212919 -0.169723 -0.151250 -0.109462 -0.104833 0.107848 0.109120 0.092454 0.093495 0.093052 0.058876 0.107829 0.092997 0.118959 0.126591 0.135628 0.107720 0.125116 0.141435 0.136309 0.137084 0.133645 0.131894
qa: -0.0294 -0.0395 -0.1853 -0.2686 -0.3518 -0.2829 -0.0006 0.1325 -0.0023 -0.1601 -0.2768 -0.2365 -0.2576 0.3311 0.0939 0.3056 0.0367 -0.2534 -0.2279 -0.1519 0.2131 -0.1304 0.1819 0.2584 -0.2129 -0.1697 -0.1513 -0.1095 -0.1048 0.1078 0.1091 0.0925 0.0935 0.0931 0.0589 0.1078 0.0930 0.1190 0.1266 0.1356 0.1077 0.1251 0.1414 0.1363 0.1371 0.1336 0.1319
va: 1.3014 1.2659 1.1156 2.1048 2.1521 2.1246 3.1217 3.7092 3.8459 3.8536 3.9159 3.8879 3.9158 4.2336 4.2072 3.8326 3.7616 4.0152 3.9253 4.0089 3.7247 3.9152 4.0974 3.7695 3.9730 3.9878 3.8966 3.9409 3.9222 1.0262 1.0247 1.0118 1.0013 1.0029 1.0157 1.0217 1.0045 1.0176 1.0185 1.0249 1.0118 1.0074 1.0028 1.0047 0.9969 0.9984 0.9981
dispcorr: -0.028058812 hartree
energy: -2149.938699812697
dipole: -0.50797 -0.51610 -1.02407 -22.36012 21.95765 -0.40247 14.20636 -13.01554 1.19082
magnitude: 1.62134 au
magnitude: 4.12112 debye
