program: Orca
programVersion: 5.0.2
elementType: Cl Cl F O O O N C C C C C C C C C C C C C C C C C C C C C C H H H H H H H H H H H H H H H H H H
charge: 0
multiplicity: 1
keywords: wb97x-d3
keywords: def2-TZVPP
keywords: def2/J RIJCOSX
keywords: DEFGRID2
keywords: scfconv7
keywords: smallprint printgap noloewdin
keywords: NOSOSCF
formula: C22H18Cl2FNO3
InChI: InChI=1/C22H18Cl2FNO3/c1-22(2)15(11-19(23)24)20(22)21(27)29-18(12-26)13-8-9-16(25)17(10-13)28-14-6-4-3-5-7-14/h3-11,15,18,20H,1-2H3
47 atoms
Cl -3.121851 5.815662 -1.072752
Cl -5.670191 4.493495 -1.355747
F  4.194522 -2.036032 2.89734
O  -0.022955 0.236326 -1.027998
O  0.68589 2.311712 -0.57298
O  2.359699 -3.621771 1.810411
N  0.986763 -1.890726 -3.368084
C  -1.793743 2.318719 1.333271
C  -2.136391 3.049793 0.068863
C  -1.544838 1.655307 -0.008367
C  -2.895179 1.71599 2.172616
C  -0.645265 2.840304 2.162854
C  -3.524512 3.248716 -0.368004
C  -0.18255 1.482938 -0.548278
C  -4.028085 4.372726 -0.86265
C  1.284006 -0.115386 -1.474869
C  2.106309 -0.651452 -0.331456
C  1.099015 -1.111675 -2.531941
C  1.85161 -1.92416 0.167981
C  3.064627 0.152462 0.266654
C  2.563977 -2.406387 1.253706
C  3.770726 -0.315998 1.36454
C  3.518431 -1.581999 1.845799
C  2.025973 -4.685378 1.012268
C  2.692618 -4.947143 -0.177313
C  1.024784 -5.53011 1.46403
C  2.338695 -6.062382 -0.920052
C  0.689844 -6.649268 0.716403
C  1.339226 -6.917161 -0.478797
H  -1.445982 3.843375 -0.192996
H  -2.227775 0.85085 -0.256596
H  -3.694367 1.272045 1.580685
H  -2.492931 0.93077 2.814084
H  -3.343014 2.475326 2.815395
H  -1.025041 3.55045 2.899006
H  -0.16071 2.027805 2.707196
H  0.112782 3.347998 1.573021
H  -4.207585 2.41177 -0.292328
H  1.783412 0.751388 -1.917932
H  1.102386 -2.554427 -0.296772
H  3.255708 1.148079 -0.109386
H  4.522691 0.29468 1.845495
H  3.480409 -4.291566 -0.525374
H  0.519824 -5.311893 2.395707
H  2.85361 -6.263245 -1.849922
H  -0.090411 -7.310046 1.069947
H  1.068921 -7.785626 -1.063688
totalener: -2149.91437255 hartree
nucrepener: 2861.74721565 hartree
electener: -5011.66158821 hartree
oneelecener: -8636.66687250 hartree
twoeener: 3625.00528430 hartree
kineticenergy: 2143.52612125 hartree
xcener: -159.167398938096 hartree
chargesum: -0.0000000
charge: -0.038285 -0.042959 -0.181986 -0.262040 -0.384034 -0.289504 -0.000174 0.063738 0.047115 -0.096316 -0.240969 -0.248655 -0.201892 0.362130 0.048179 0.329998 -0.009783 -0.268076 -0.163850 -0.120604 0.147019 -0.150643 0.192888 0.232200 -0.151216 -0.204671 -0.105632 -0.092676 -0.139455 0.088276 0.081660 0.073253 0.095454 0.099721 0.090828 0.089237 0.102405 0.097571 0.123214 0.132991 0.125060 0.128468 0.132404 0.126952 0.129123 0.126400 0.127136
qa: -0.0383 -0.0430 -0.1820 -0.2620 -0.3840 -0.2895 -0.0002 0.0637 0.0471 -0.0963 -0.2410 -0.2487 -0.2019 0.3621 0.0482 0.3300 -0.0098 -0.2681 -0.1639 -0.1206 0.1470 -0.1506 0.1929 0.2322 -0.1512 -0.2047 -0.1056 -0.0927 -0.1395 0.0883 0.0817 0.0733 0.0955 0.0997 0.0908 0.0892 0.1024 0.0976 0.1232 0.1330 0.1251 0.1285 0.1324 0.1270 0.1291 0.1264 0.1271
va: 1.2892 1.2623 1.1217 2.1338 2.1175 2.1190 3.1141 3.7595 3.8264 3.8772 3.9092 3.9130 3.9138 4.2303 4.2527 3.8265 3.7031 4.0314 3.9663 3.9191 3.7919 3.9190 4.0994 3.8091 3.9455 4.0380 3.9583 3.9372 3.9642 1.0479 1.0363 1.0102 1.0040 1.0030 1.0021 1.0016 1.0207 1.0303 1.0199 1.0151 1.0190 1.0068 1.0021 1.0123 0.9999 0.9988 1.0000
dispcorr: -0.023515622 hartree
energy: -2149.937888176632
dipole: 8.53582 -8.72160 -0.18579 -22.16225 22.08647 -0.07578 12.57067 -11.56062 1.01005
magnitude: 1.02979 au
magnitude: 2.61751 debye
