program: Orca
programVersion: 5.0.2
elementType: Cl Cl F O O O N C C C C C C C C C C C C C C C C C C C C C C H H H H H H H H H H H H H H H H H H
charge: 0
multiplicity: 1
keywords: wb97x-d3
keywords: def2-TZVPP
keywords: def2/J RIJCOSX
keywords: DEFGRID2
keywords: scfconv7
keywords: smallprint printgap noloewdin
keywords: NOSOSCF
formula: C22H18Cl2FNO3
InChI: InChI=1/C22H18Cl2FNO3/c1-22(2)15(11-19(23)24)20(22)21(27)29-18(12-26)13-8-9-16(25)17(10-13)28-14-6-4-3-5-7-14/h3-11,15,18,20H,1-2H3
47 atoms
Cl -1.953782 0.045991 -1.416274
Cl -4.673011 -0.578558 -0.667634
F  4.724466 -3.129439 1.134283
O  0.953128 1.659291 0.273154
O  0.427658 3.599864 -0.700573
O  2.143167 -3.215206 0.595012
N  1.731648 1.387174 -3.026333
C  -2.102403 3.568787 1.149846
C  -2.433476 2.770829 -0.065555
C  -1.162071 2.468262 0.704965
C  -2.853542 3.279079 2.428312
C  -1.736444 5.023893 0.987948
C  -3.516941 1.763428 -0.084352
C  0.124611 2.689899 0.018373
C  -3.392693 0.568003 -0.646347
C  2.166809 1.585463 -0.451865
C  2.877066 0.333392 -0.001114
C  1.902819 1.503842 -1.896425
C  2.148977 -0.849778 0.0838
C  4.226588 0.347284 0.29539
C  2.767397 -2.022813 0.475457
C  4.859554 -0.831402 0.67541
C  4.13288 -1.995303 0.764075
C  0.772315 -3.227618 0.493974
C  0.002413 -2.903113 1.600027
C  0.184521 -3.568027 -0.712745
C  -1.37939 -2.914889 1.489135
C  -1.199328 -3.577857 -0.810546
C  -1.982763 -3.245275 0.284243
H  -2.266045 3.279126 -1.012205
H  -1.188152 1.567304 1.306807
H  -2.26166 3.579785 3.293678
H  -3.790357 3.8386 2.459195
H  -3.093393 2.221696 2.544664
H  -1.060079 5.343715 1.782042
H  -1.257838 5.238762 0.036606
H  -2.638002 5.634804 1.057259
H  -4.472106 2.013603 0.362179
H  2.788383 2.468761 -0.272005
H  1.093082 -0.852451 -0.153029
H  4.797173 1.264747 0.233099
H  5.914814 -0.845056 0.911963
H  0.483428 -2.643536 2.534419
H  0.805035 -3.818325 -1.563352
H  -1.985933 -2.661992 2.348607
H  -1.665329 -3.837315 -1.751547
H  -3.060325 -3.238694 0.197494
totalener: -2149.90856853 hartree
nucrepener: 3109.23109656 hartree
electener: -5259.13966509 hartree
oneelecener: -9132.05184360 hartree
twoeener: 3872.91217851 hartree
kineticenergy: 2143.54387671 hartree
xcener: -159.170528917918 hartree
chargesum: 0.0000000
charge: -0.025346 -0.049064 -0.184823 -0.264465 -0.356794 -0.287059 0.000728 0.129647 -0.025710 -0.152444 -0.271559 -0.247983 -0.240379 0.347006 0.105742 0.322750 0.005609 -0.261112 -0.116374 -0.159425 0.171523 -0.131698 0.180579 0.187216 -0.129774 -0.121470 -0.120598 -0.139032 -0.137508 0.117922 0.100912 0.096229 0.095294 0.085196 0.086900 0.105566 0.084282 0.120416 0.108976 0.085605 0.113395 0.124050 0.129669 0.130959 0.127869 0.129753 0.128820
qa: -0.0253 -0.0491 -0.1848 -0.2645 -0.3568 -0.2871 0.0007 0.1296 -0.0257 -0.1524 -0.2716 -0.2480 -0.2404 0.3470 0.1057 0.3227 0.0056 -0.2611 -0.1164 -0.1594 0.1715 -0.1317 0.1806 0.1872 -0.1298 -0.1215 -0.1206 -0.1390 -0.1375 0.1179 0.1009 0.0962 0.0953 0.0852 0.0869 0.1056 0.0843 0.1204 0.1090 0.0856 0.1134 0.1240 0.1297 0.1310 0.1279 0.1298 0.1288
va: 1.3149 1.2587 1.1169 2.1352 2.1379 2.1204 3.1141 3.7162 3.8623 3.8924 3.9143 3.8996 3.9110 4.1944 4.1649 3.8753 3.8190 3.9685 3.9308 3.9571 3.7724 3.9282 4.0989 3.8561 3.9868 3.9667 3.9204 3.9194 3.8899 1.0212 1.0222 1.0065 1.0014 1.0011 1.0026 1.0218 1.0021 1.0153 1.0184 1.0574 1.0115 1.0081 1.0044 1.0066 0.9996 1.0019 1.0093
dispcorr: -0.028457267 hartree
energy: -2149.937025799654
dipole: -6.72944 5.87449 -0.85495 21.00652 -20.42792 0.57860 15.04462 -13.27798 1.76664
magnitude: 2.04615 au
magnitude: 5.20090 debye
