program: Orca
programVersion: 5.0.2
elementType: Cl Cl F O O O N C C C C C C C C C C C C C C C C C C C C C C H H H H H H H H H H H H H H H H H H
charge: 0
multiplicity: 1
keywords: wb97x-d3
keywords: def2-TZVPP
keywords: def2/J RIJCOSX
keywords: DEFGRID2
keywords: scfconv7
keywords: smallprint printgap noloewdin
keywords: NOSOSCF
formula: C22H18Cl2FNO3
InChI: InChI=1/C22H18Cl2FNO3/c1-22(2)15(11-19(23)24)20(22)21(27)29-18(12-26)13-8-9-16(25)17(10-13)28-14-6-4-3-5-7-14/h3-11,15,18,20H,1-2H3
47 atoms
Cl -3.00427 -0.432754 -2.358799
Cl -4.745419 -0.972767 -0.125451
F  3.69137 -3.105567 -0.932667
O  1.340349 2.265946 1.227842
O  1.055252 2.252483 -0.988601
O  2.247518 -2.787976 1.325238
N  3.895192 4.027882 -0.200321
C  -1.79651 3.340314 -0.226917
C  -1.864438 1.877563 -0.550438
C  -0.848527 2.378592 0.46055
C  -2.853348 3.965237 0.653026
C  -1.297645 4.275211 -1.302393
C  -2.95261 1.010254 -0.084258
C  0.582885 2.294232 0.111006
C  -3.495104 0.014144 -0.773795
C  2.731901 2.049288 1.050788
C  3.032148 0.68277 0.476501
C  3.360295 3.150789 0.313314
C  2.508127 -0.41639 1.145435
C  3.793887 0.490245 -0.665922
C  2.728985 -1.698887 0.673728
C  4.035764 -0.791553 -1.134653
C  3.492525 -1.873748 -0.472803
C  0.894588 -2.99359 1.346016
C  0.407759 -3.792513 2.371536
C  0.033794 -2.468018 0.39189
C  -0.948616 -4.064234 2.439343
C  -1.322151 -2.750055 0.475097
C  -1.822231 -3.542399 1.495478
H  -1.436343 1.611464 -1.510102
H  -1.065684 2.183554 1.504671
H  -3.15292 3.331578 1.487252
H  -2.484394 4.900288 1.076245
H  -3.748162 4.193292 0.071978
H  -0.58365 3.80892 -1.975852
H  -2.141356 4.623884 -1.899754
H  -0.819786 5.151776 -0.86171
H  -3.348751 1.175375 0.910068
H  3.130112 2.101488 2.06797
H  1.910778 -0.291116 2.041087
H  4.197825 1.33554 -1.20613
H  4.62426 -0.951614 -2.027755
H  1.093667 -4.197497 3.103953
H  0.403338 -1.851585 -0.417355
H  -1.323609 -4.687319 3.240568
H  -1.98757 -2.352478 -0.278321
H  -2.881277 -3.753604 1.550365
totalener: -2149.91110081 hartree
nucrepener: 3067.67504713 hartree
electener: -5217.58614794 hartree
oneelecener: -9048.51660320 hartree
twoeener: 3830.93045526 hartree
kineticenergy: 2143.53075926 hartree
xcener: -159.170752203879 hartree
chargesum: 0.0000000
charge: -0.042432 -0.046055 -0.182325 -0.279789 -0.357029 -0.297698 0.006892 0.057324 0.050344 -0.070752 -0.246832 -0.241688 -0.186073 0.346505 0.032567 0.423582 -0.071146 -0.289168 -0.197397 -0.079893 0.122500 -0.158078 0.226233 0.248313 -0.204263 -0.149597 -0.087548 -0.121863 -0.154024 0.089383 0.077669 0.072855 0.096143 0.101048 0.104642 0.089801 0.090700 0.096456 0.124431 0.128060 0.124060 0.128675 0.125446 0.124893 0.124944 0.127549 0.122635
qa: -0.0424 -0.0461 -0.1823 -0.2798 -0.3570 -0.2977 0.0069 0.0573 0.0503 -0.0708 -0.2468 -0.2417 -0.1861 0.3465 0.0326 0.4236 -0.0711 -0.2892 -0.1974 -0.0799 0.1225 -0.1581 0.2262 0.2483 -0.2043 -0.1496 -0.0875 -0.1219 -0.1540 0.0894 0.0777 0.0729 0.0961 0.1010 0.1046 0.0898 0.0907 0.0965 0.1244 0.1281 0.1241 0.1287 0.1254 0.1249 0.1249 0.1275 0.1226
va: 1.2820 1.2564 1.1213 2.1086 2.1396 2.1137 3.1122 3.8020 3.8105 3.8583 3.9088 3.9144 3.9197 4.2126 4.2501 3.8966 3.7678 4.0511 3.9984 3.8993 3.8192 3.9335 4.0945 3.7875 4.0210 3.9014 3.9521 3.9346 3.9813 1.0487 1.0358 1.0098 1.0044 1.0021 1.0213 1.0006 1.0028 1.0327 0.9889 1.0190 1.0226 1.0071 1.0138 1.0165 0.9983 1.0132 1.0054
dispcorr: -0.027250953 hartree
energy: -2149.938351760869
dipole: -2.42144 1.35440 -1.06704 19.96834 -19.73540 0.23294 10.00475 -8.89454 1.11021
magnitude: 1.55737 au
magnitude: 3.95852 debye
