program: Orca
programVersion: 5.0.2
elementType: Cl Cl F O O O N C C C C C C C C C C C C C C C C C C C C C C H H H H H H H H H H H H H H H H H H
charge: 0
multiplicity: 1
keywords: wb97x-d3
keywords: def2-TZVPP
keywords: def2/J RIJCOSX
keywords: DEFGRID2
keywords: scfconv7
keywords: smallprint printgap noloewdin
keywords: NOSOSCF
formula: C22H18Cl2FNO3
InChI: InChI=1/C22H18Cl2FNO3/c1-22(2)15(11-19(23)24)20(22)21(27)29-18(12-26)13-8-9-16(25)17(10-13)28-14-6-4-3-5-7-14/h3-11,15,18,20H,1-2H3
47 atoms
Cl -3.007268 5.455823 -1.681184
Cl -5.596661 4.18594 -1.636696
F  4.903589 -1.961423 2.373542
O  0.05304 0.165698 -0.979265
O  0.764652 2.246738 -0.563742
O  2.753429 -3.417334 1.870646
N  0.924542 -2.025138 -3.310336
C  -1.719324 2.351436 1.338128
C  -2.07912 2.975131 0.023959
C  -1.454241 1.589203 0.055146
C  -2.804922 1.78761 2.22485
C  -0.587812 2.968709 2.123586
C  -3.467622 3.114955 -0.430913
C  -0.099461 1.415607 -0.504638
C  -3.948742 4.120663 -1.151946
C  1.326205 -0.154606 -1.529546
C  2.290046 -0.627021 -0.471042
C  1.080788 -1.200277 -2.526383
C  2.043926 -1.823719 0.19446
C  3.401801 0.133084 -0.149595
C  2.924605 -2.280207 1.160194
C  4.287391 -0.314184 0.821235
C  4.04964 -1.511857 1.456999
C  2.062518 -4.461176 1.310536
C  1.033631 -5.023281 2.047445
C  2.4084 -4.970687 0.066368
C  0.3447 -6.11153 1.532024
C  1.704455 -6.050357 -0.441346
C  0.671254 -6.623814 0.286119
H  -1.402451 3.756616 -0.301926
H  -2.121924 0.75602 -0.131055
H  -2.376507 1.086669 2.942159
H  -3.290595 2.585427 2.788501
H  -3.577643 1.251327 1.675612
H  -0.097758 2.220889 2.749058
H  0.169878 3.426816 1.494449
H  -0.985998 3.740994 2.783376
H  -4.171416 2.334933 -0.169239
H  1.747414 0.710973 -2.049835
H  1.169654 -2.414401 -0.052557
H  3.582603 1.075514 -0.64817
H  5.166267 0.260271 1.080713
H  0.783647 -4.613716 3.017131
H  3.21769 -4.530894 -0.502072
H  -0.457193 -6.553804 2.107618
H  1.968976 -6.445557 -1.412743
H  0.126654 -7.467018 -0.115981
totalener: -2149.91441410 hartree
nucrepener: 2867.62801415 hartree
electener: -5017.54242824 hartree
oneelecener: -8648.48819299 hartree
twoeener: 3630.94576475 hartree
kineticenergy: 2143.52705064 hartree
xcener: -159.167477764076 hartree
chargesum: 0.0000000
charge: -0.038171 -0.043165 -0.182733 -0.267016 -0.381598 -0.287890 -0.002437 0.068806 0.038312 -0.095204 -0.248722 -0.246643 -0.199650 0.361857 0.051329 0.334423 -0.019538 -0.264001 -0.158717 -0.109674 0.144498 -0.150301 0.194809 0.223749 -0.196448 -0.153825 -0.098688 -0.105508 -0.135678 0.086986 0.083137 0.094322 0.100950 0.075092 0.088241 0.103072 0.090433 0.096701 0.120370 0.132728 0.119222 0.126911 0.127703 0.135309 0.127304 0.131124 0.128217
qa: -0.0382 -0.0432 -0.1827 -0.2670 -0.3816 -0.2879 -0.0024 0.0688 0.0383 -0.0952 -0.2487 -0.2466 -0.1997 0.3619 0.0513 0.3344 -0.0195 -0.2640 -0.1587 -0.1097 0.1445 -0.1503 0.1948 0.2237 -0.1964 -0.1538 -0.0987 -0.1055 -0.1357 0.0870 0.0831 0.0943 0.1009 0.0751 0.0882 0.1031 0.0904 0.0967 0.1204 0.1327 0.1192 0.1269 0.1277 0.1353 0.1273 0.1311 0.1282
va: 1.2893 1.2618 1.1204 2.1349 2.1218 2.1195 3.1159 3.7541 3.8374 3.8686 3.9115 3.9138 3.9231 4.2289 4.2560 3.8291 3.7085 4.0250 3.9403 3.9302 3.7915 3.9247 4.0864 3.8160 4.0379 3.9632 3.9365 3.9536 3.9601 1.0496 1.0350 1.0043 1.0020 1.0099 1.0023 1.0212 1.0009 1.0321 1.0205 1.0165 1.0168 1.0071 1.0118 1.0018 0.9990 0.9996 0.9999
dispcorr: -0.023330074 hartree
energy: -2149.937744169062
dipole: 5.95215 -6.27384 -0.32169 -19.50497 19.52008 0.01512 16.82806 -15.72002 1.10805
magnitude: 1.15390 au
magnitude: 2.93298 debye
