program: Orca
programVersion: 5.0.2
elementType: Cl Cl F O O O N C C C C C C C C C C C C C C C C C C C C C C H H H H H H H H H H H H H H H H H H
charge: 0
multiplicity: 1
keywords: wb97x-d3
keywords: def2-TZVPP
keywords: def2/J RIJCOSX
keywords: DEFGRID2
keywords: scfconv7
keywords: smallprint printgap noloewdin
keywords: NOSOSCF
formula: C22H18Cl2FNO3
InChI: InChI=1/C22H18Cl2FNO3/c1-22(2)15(11-19(23)24)20(22)21(27)29-18(12-26)13-8-9-16(25)17(10-13)28-14-6-4-3-5-7-14/h3-11,15,18,20H,1-2H3
47 atoms
Cl -2.223637 -0.484646 -2.16015
Cl -4.602217 -1.156241 -0.675025
F  4.195013 -3.06879 0.478864
O  0.929431 2.258712 -0.104387
O  1.126068 1.94653 2.097349
O  1.647924 -2.70083 -0.259873
N  2.848555 3.011118 -2.6713
C  -1.933372 3.179425 0.585457
C  -1.896765 1.82829 -0.063198
C  -1.047315 2.095945 1.1711
C  -3.113258 3.579512 1.438817
C  -1.342187 4.34529 -0.169878
C  -3.011375 0.877205 0.029964
C  0.426029 2.096536 1.129409
C  -3.236731 -0.118542 -0.818272
C  2.334987 2.166756 -0.252433
C  2.845602 0.75137 -0.083767
C  2.603356 2.647182 -1.610061
C  2.003258 -0.323087 -0.323083
C  4.156852 0.536349 0.315836
C  2.449196 -1.615446 -0.099235
C  4.627473 -0.757378 0.47902
C  3.766911 -1.817999 0.285732
C  0.39271 -2.682551 0.298207
C  0.099654 -1.983162 1.463064
C  -0.582625 -3.432859 -0.342125
C  -1.189438 -2.034885 1.974833
C  -1.863628 -3.480359 0.18726
C  -2.175671 -2.778617 1.343549
H  -1.343567 1.793538 -0.993901
H  -1.411021 1.67539 2.101844
H  -3.941298 3.919748 0.814033
H  -3.479956 2.773556 2.073231
H  -2.834668 4.404195 2.097022
H  -0.889287 5.064028 0.515729
H  -0.592191 4.055906 -0.902234
H  -2.135462 4.864482 -0.710714
H  -3.71549 0.988387 0.84572
H  2.854166 2.835497 0.442967
H  0.984354 -0.172513 -0.658376
H  4.816353 1.373194 0.506984
H  5.648394 -0.940978 0.787228
H  0.854769 -1.400913 1.975738
H  -0.340152 -3.971267 -1.249887
H  -1.417722 -1.485748 2.879396
H  -2.623209 -4.063586 -0.316615
H  -3.178317 -2.808794 1.747711
elementType: Cl F O N C H
totalener: -2149.93495635 hartree
nucrepener: 3165.73527790 hartree
electener: -5315.67023425 hartree
oneelecener: -9244.57539474 hartree
twoeener: 3928.90516049 hartree
cpcmener: -0.03318013 hartree
kineticenergy: 2143.46699095 hartree
xcener: -159.166149394714 hartree
chargesum: -0.0000000
charge: -0.060146 -0.064651 -0.207508 -0.279197 -0.427470 -0.327712 -0.083642 0.088334 0.062926 -0.076650 -0.286515 -0.260478 -0.250443 0.379546 0.082691 0.367512 0.019695 -0.230160 -0.156360 -0.193674 0.186809 -0.156547 0.200724 0.301057 -0.172869 -0.254831 -0.176836 -0.122573 -0.165735 0.090238 0.104551 0.104968 0.093522 0.100565 0.102188 0.093851 0.097343 0.128229 0.149561 0.138014 0.147882 0.151777 0.151921 0.144488 0.158308 0.152737 0.154559
qa: -0.0601 -0.0647 -0.2075 -0.2792 -0.4275 -0.3277 -0.0836 0.0883 0.0629 -0.0766 -0.2865 -0.2605 -0.2504 0.3795 0.0827 0.3675 0.0197 -0.2302 -0.1564 -0.1937 0.1868 -0.1565 0.2007 0.3011 -0.1729 -0.2548 -0.1768 -0.1226 -0.1657 0.0902 0.1046 0.1050 0.0935 0.1006 0.1022 0.0939 0.0973 0.1282 0.1496 0.1380 0.1479 0.1518 0.1519 0.1445 0.1583 0.1527 0.1546
va: 1.2624 1.2366 1.0863 2.1065 2.0751 2.0934 3.1098 3.8151 3.7699 3.8180 3.9180 3.9080 3.9115 4.1681 4.1760 3.7397 3.6374 4.0651 3.9422 3.9582 3.7139 3.8696 4.0735 3.6623 3.8327 3.9789 3.8712 3.8354 3.8151 1.0389 1.0233 0.9993 1.0050 1.0006 0.9998 1.0107 1.0005 1.0237 1.0132 1.0113 1.0001 0.9969 1.0043 1.0075 0.9926 0.9948 0.9969
dispcorr: -0.031217224 hartree
energy: -2149.966173571886
dipole: -5.86897 4.66991 -1.19907 22.64178 -21.27452 1.36726 14.76416 -13.19578 1.56839
magnitude: 2.40146 au
magnitude: 6.10402 debye
