program: Orca
programVersion: 5.0.2
elementType: Cl Cl F O O O N C C C C C C C C C C C C C C C C C C C C C C H H H H H H H H H H H H H H H H H H
charge: 0
multiplicity: 1
keywords: wb97x-d3
keywords: def2-TZVPP
keywords: def2/J RIJCOSX
keywords: DEFGRID2
keywords: scfconv7
keywords: smallprint printgap noloewdin
keywords: NOSOSCF
formula: C22H18Cl2FNO3
InChI: InChI=1/C22H18Cl2FNO3/c1-22(2)15(11-19(23)24)20(22)21(27)29-18(12-26)13-8-9-16(25)17(10-13)28-14-6-4-3-5-7-14/h3-11,15,18,20H,1-2H3
47 atoms
Cl -3.215643 -0.652553 -2.248126
Cl -4.906314 -1.079765 0.05031
F  4.257928 -3.014244 -0.947112
O  1.218614 2.121509 1.175083
O  0.940452 2.195087 -1.037838
O  1.836384 -2.80999 0.036641
N  3.648583 4.027129 -0.245735
C  -1.941982 3.181962 -0.298053
C  -1.990243 1.70473 -0.552006
C  -0.96639 2.270123 0.420517
C  -2.989903 3.83144 0.573668
C  -1.48389 4.075148 -1.424866
C  -3.060101 0.85517 -0.015826
C  0.458127 2.195945 0.063684
C  -3.636748 -0.1536 -0.656398
C  2.613915 1.978919 1.010775
C  3.038183 0.64529 0.421861
C  3.169852 3.119148 0.269056
C  2.183737 -0.449717 0.507021
C  4.306401 0.499431 -0.117965
C  2.593111 -1.688205 0.037158
C  4.724544 -0.740824 -0.580403
C  3.871241 -1.814137 -0.499753
C  0.597002 -2.805272 0.634561
C  0.482044 -2.76044 2.016369
C  -0.521387 -2.908524 -0.176286
C  -0.780604 -2.816557 2.588954
C  -1.777509 -2.98075 0.410455
C  -1.911814 -2.927184 1.790455
H  -1.579913 1.400481 -1.50831
H  -1.17363 2.116928 1.473322
H  -3.255198 3.236838 1.447121
H  -2.628893 4.79532 0.936241
H  -3.90218 4.013138 0.002463
H  -2.355963 4.439439 -1.971013
H  -0.951094 4.946113 -1.038885
H  -0.838886 3.573512 -2.141844
H  -3.417123 1.061527 0.986114
H  3.012488 2.056698 2.026673
H  1.196419 -0.350343 0.938402
H  4.988241 1.337342 -0.184946
H  5.712149 -0.868233 -1.004172
H  1.365857 -2.686135 2.638039
H  -0.410728 -2.945132 -1.252794
H  -0.877491 -2.780157 3.666301
H  -2.652127 -3.083766 -0.21751
H  -2.892989 -2.978756 2.243791
elementType: Cl F O N C H
totalener: -2149.93659601 hartree
nucrepener: 3088.16299034 hartree
electener: -5238.09958635 hartree
oneelecener: -9089.75660755 hartree
twoeener: 3851.65702121 hartree
cpcmener: -0.03421079 hartree
kineticenergy: 2143.45844573 hartree
xcener: -159.165129215493 hartree
chargesum: 0.0000000
charge: -0.055167 -0.059620 -0.211652 -0.293164 -0.427309 -0.320543 -0.084436 0.086199 0.044980 -0.079144 -0.265995 -0.268338 -0.207836 0.382281 0.047653 0.490468 -0.065341 -0.247690 -0.221901 -0.213446 0.261413 -0.142327 0.184048 0.253209 -0.189249 -0.200462 -0.142485 -0.126516 -0.158011 0.085780 0.095833 0.090837 0.099423 0.102643 0.098037 0.101880 0.096381 0.129267 0.149987 0.140967 0.137303 0.150121 0.154748 0.144284 0.159389 0.141454 0.152047
qa: -0.0552 -0.0596 -0.2117 -0.2932 -0.4273 -0.3205 -0.0844 0.0862 0.0450 -0.0791 -0.2660 -0.2683 -0.2078 0.3823 0.0477 0.4905 -0.0653 -0.2477 -0.2219 -0.2134 0.2614 -0.1423 0.1840 0.2532 -0.1892 -0.2005 -0.1425 -0.1265 -0.1580 0.0858 0.0958 0.0908 0.0994 0.1026 0.0980 0.1019 0.0964 0.1293 0.1500 0.1410 0.1373 0.1501 0.1547 0.1443 0.1594 0.1415 0.1520
va: 1.2687 1.2453 1.0771 2.1285 2.0781 2.0895 3.1029 3.7686 3.8513 3.8627 3.9082 3.9042 3.9121 4.1593 4.2143 3.7760 3.8610 4.0965 3.9400 3.9495 3.6944 3.8961 4.0583 3.7187 3.9448 4.0086 3.9101 3.8365 3.8857 1.0453 1.0364 1.0060 1.0013 1.0003 0.9999 0.9996 1.0190 1.0199 0.9855 1.0225 1.0120 0.9989 0.9975 1.0101 0.9893 1.0123 0.9996
dispcorr: -0.027921977 hartree
energy: -2149.964517983925
dipole: -2.38460 0.91257 -1.47203 21.16302 -20.89123 0.27179 10.81085 -8.33837 2.47248
magnitude: 2.89032 au
magnitude: 7.34660 debye
