program: Orca
programVersion: 5.0.2
elementType: Cl Cl F O O O N C C C C C C C C C C C C C C C C C C C C C C H H H H H H H H H H H H H H H H H H
charge: 0
multiplicity: 1
keywords: wb97x-d3
keywords: def2-TZVPP
keywords: def2/J RIJCOSX
keywords: DEFGRID2
keywords: scfconv7
keywords: smallprint printgap noloewdin
keywords: NOSOSCF
formula: C22H18Cl2FNO3
InChI: InChI=1/C22H18Cl2FNO3/c1-22(2)15(11-19(23)24)20(22)21(27)29-18(12-26)13-8-9-16(25)17(10-13)28-14-6-4-3-5-7-14/h3-11,15,18,20H,1-2H3
47 atoms
Cl -5.206625 2.777449 0.976936
Cl -5.267879 5.338141 -0.351193
F  3.503292 -3.665099 -1.303617
O  1.103539 2.060054 -0.159985
O  -0.457226 0.770328 0.783002
O  3.218651 -3.271874 1.393897
N  4.21667 2.926948 0.483609
C  -1.977532 1.60811 -1.867913
C  -2.558653 2.305768 -0.671382
C  -1.06401 2.355364 -0.913716
C  -2.134957 2.213764 -3.241483
C  -1.995386 0.099637 -1.882707
C  -3.32581 3.551601 -0.796849
C  -0.160712 1.632135 -0.002457
C  -4.443982 3.839769 -0.142879
C  2.097486 1.403931 0.611744
C  2.433201 0.029449 0.081294
C  3.274129 2.273032 0.532683
C  2.59981 -1.022656 0.970994
C  2.599959 -0.17476 -1.281844
C  2.964091 -2.274453 0.505754
C  2.945731 -1.43014 -1.756762
C  3.13769 -2.459412 -0.860685
C  2.510217 -4.443805 1.335944
C  3.116704 -5.550194 1.916025
C  1.244559 -4.539396 0.775506
C  2.451548 -6.765473 1.924954
C  0.594303 -5.766966 0.787303
C  1.189971 -6.882861 1.355322
H  -2.865715 1.643121 0.129766
H  -0.66195 3.284842 -1.300922
H  -3.12145 1.983404 -3.648284
H  -2.013709 3.296179 -3.251316
H  -1.390886 1.798058 -3.923026
H  -1.120803 -0.293632 -2.405015
H  -2.023304 -0.343485 -0.889438
H  -2.881109 -0.247895 -2.417465
H  -2.951539 4.310324 -1.473931
H  1.805071 1.341678 1.665179
H  2.462442 -0.873971 2.035484
H  2.47175 0.636716 -1.986441
H  3.085702 -1.604736 -2.815592
H  4.102534 -5.456282 2.354028
H  0.754292 -3.677709 0.339546
H  2.928579 -7.626969 2.374159
H  -0.39179 -5.842951 0.347497
H  0.675943 -7.8348 1.356384
elementType: Cl F O N C H
totalener: -2149.93936525 hartree
nucrepener: 2862.09116789 hartree
electener: -5012.03053315 hartree
oneelecener: -8637.14833076 hartree
twoeener: 3625.11779761 hartree
cpcmener: -0.03337101 hartree
kineticenergy: 2143.46816753 hartree
xcener: -159.159507999347 hartree
chargesum: -0.0000000
charge: -0.054980 -0.059066 -0.206741 -0.279994 -0.435494 -0.321432 -0.085624 0.088866 0.030440 -0.071333 -0.264214 -0.263333 -0.202419 0.370817 0.039920 0.408638 -0.002227 -0.229030 -0.179893 -0.182901 0.147867 -0.170544 0.275832 0.280073 -0.247038 -0.176491 -0.120324 -0.157545 -0.184695 0.080631 0.098717 0.102603 0.090816 0.098728 0.097694 0.095334 0.100304 0.130255 0.142073 0.140095 0.150764 0.152672 0.145129 0.154914 0.156243 0.158643 0.157250
qa: -0.0550 -0.0591 -0.2067 -0.2800 -0.4355 -0.3214 -0.0856 0.0889 0.0304 -0.0713 -0.2642 -0.2633 -0.2024 0.3708 0.0399 0.4086 -0.0022 -0.2290 -0.1799 -0.1829 0.1479 -0.1705 0.2758 0.2801 -0.2470 -0.1765 -0.1203 -0.1575 -0.1847 0.0806 0.0987 0.1026 0.0908 0.0987 0.0977 0.0953 0.1003 0.1303 0.1421 0.1401 0.1508 0.1527 0.1451 0.1549 0.1562 0.1586 0.1573
va: 1.2705 1.2458 1.0845 2.1251 2.0772 2.0770 3.1128 3.7379 3.8783 3.8347 3.9065 3.9060 3.8931 4.2225 4.2144 3.7119 3.6213 4.0858 4.0273 3.9228 3.7814 3.9236 3.9780 3.6824 3.9946 3.8769 3.8968 3.9103 3.9031 1.0477 1.0324 1.0008 1.0056 1.0014 1.0000 1.0165 1.0011 1.0179 1.0182 1.0137 1.0099 0.9979 1.0089 1.0024 0.9894 0.9909 0.9904
dispcorr: -0.023772687 hartree
energy: -2149.963137942234
dipole: 9.79373 -10.78045 -0.98672 -21.92024 21.35977 -0.56047 -12.00864 10.52261 -1.48603
magnitude: 1.86977 au
magnitude: 4.75257 debye
