program: Orca
programVersion: 5.0.2
elementType: Cl Cl F O O O N C C C C C C C C C C C C C C C C C C C C C C H H H H H H H H H H H H H H H H H H
charge: 0
multiplicity: 1
keywords: wb97x-d3
keywords: def2-TZVPP
keywords: def2/J RIJCOSX
keywords: DEFGRID2
keywords: scfconv7
keywords: smallprint printgap noloewdin
keywords: NOSOSCF
formula: C22H18Cl2FNO3
InChI: InChI=1/C22H18Cl2FNO3/c1-22(2)15(11-19(23)24)20(22)21(27)29-18(12-26)13-8-9-16(25)17(10-13)28-14-6-4-3-5-7-14/h3-11,15,18,20H,1-2H3
47 atoms
Cl -5.195043 2.9139 0.983509
Cl -5.24333 5.444729 -0.401306
F  3.364462 -3.702065 -1.241116
O  1.086425 2.088977 -0.151351
O  -0.496644 0.855716 0.831588
O  3.082443 -3.258692 1.472504
N  4.223683 2.896001 0.404865
C  -1.967612 1.668889 -1.869732
C  -2.573697 2.373948 -0.689114
C  -1.074786 2.417546 -0.897585
C  -2.082813 2.263859 -3.251946
C  -1.996416 0.160728 -1.872111
C  -3.329762 3.623996 -0.833789
C  -0.185876 1.695214 0.028002
C  -4.435348 3.940417 -0.171444
C  2.077041 1.420158 0.614033
C  2.368053 0.028972 0.101844
C  3.272111 2.259352 0.493526
C  2.502845 -1.016902 1.003509
C  2.531585 -0.195129 -1.258767
C  2.840631 -2.284635 0.557472
C  2.84589 -1.46476 -1.7155
C  3.014286 -2.488023 -0.807075
C  2.488765 -4.490209 1.366257
C  3.201126 -5.558858 1.893108
C  1.229965 -4.676825 0.813565
C  2.651046 -6.830234 1.8547
C  0.695887 -5.958564 0.776282
C  1.399687 -7.038644 1.289291
H  -2.902923 1.714542 0.105977
H  -0.662878 3.344185 -1.281291
H  -1.963825 3.346418 -3.265884
H  -1.313803 1.845535 -3.903561
H  -3.053475 2.027163 -3.691442
H  -2.012438 -0.274013 -0.874839
H  -2.892327 -0.18518 -2.390481
H  -1.132198 -0.24286 -2.403526
H  -2.95545 4.363056 -1.532303
H  1.80489 1.385945 1.674206
H  2.36742 -0.850839 2.065656
H  2.429234 0.611616 -1.97313
H  2.986557 -1.656651 -2.771257
H  4.179624 -5.392272 2.326284
H  0.659913 -3.843711 0.420333
H  3.211344 -7.662321 2.261388
H  -0.284101 -6.108143 0.341684
H  0.976492 -8.033788 1.251401
elementType: Cl F O N C H
totalener: -2149.93875798 hartree
nucrepener: 2858.10749097 hartree
electener: -5008.04624895 hartree
oneelecener: -8629.24089111 hartree
twoeener: 3621.19464216 hartree
cpcmener: -0.03328310 hartree
kineticenergy: 2143.46210531 hartree
xcener: -159.158224321433 hartree
chargesum: 0.0000000
charge: -0.055174 -0.059420 -0.207318 -0.278170 -0.433600 -0.320328 -0.086294 0.088994 0.029186 -0.071712 -0.264351 -0.262308 -0.200196 0.369055 0.039374 0.409171 0.003202 -0.229243 -0.192459 -0.193323 0.154637 -0.166427 0.278585 0.276117 -0.249190 -0.178396 -0.119889 -0.150918 -0.185031 0.079588 0.098885 0.091168 0.098747 0.102582 0.095126 0.101230 0.096525 0.129331 0.141833 0.140032 0.150845 0.152437 0.145289 0.157994 0.157416 0.158874 0.157523
qa: -0.0552 -0.0594 -0.2073 -0.2782 -0.4336 -0.3203 -0.0863 0.0890 0.0292 -0.0717 -0.2644 -0.2623 -0.2002 0.3691 0.0394 0.4092 0.0032 -0.2292 -0.1925 -0.1933 0.1546 -0.1664 0.2786 0.2761 -0.2492 -0.1784 -0.1199 -0.1509 -0.1850 0.0796 0.0989 0.0912 0.0987 0.1026 0.0951 0.1012 0.0965 0.1293 0.1418 0.1400 0.1508 0.1524 0.1453 0.1580 0.1574 0.1589 0.1575
va: 1.2703 1.2452 1.0819 2.1248 2.0798 2.0761 3.1121 3.7456 3.8831 3.8244 3.9046 3.9055 3.8952 4.2335 4.2148 3.7113 3.6204 4.0858 4.0314 3.9271 3.7858 3.9241 3.9566 3.6828 4.0026 3.8895 3.8923 3.9022 3.9043 1.0481 1.0324 1.0056 1.0014 1.0009 1.0168 1.0011 1.0007 1.0187 1.0178 1.0147 1.0100 0.9980 1.0088 0.9996 0.9891 0.9906 0.9904
dispcorr: -0.023763092 hartree
energy: -2149.962521071574
dipole: 10.53816 -11.45061 -0.91244 -22.54018 21.87866 -0.66151 -12.16448 10.68792 -1.47656
magnitude: 1.85752 au
magnitude: 4.72145 debye
